program: Orca
programVersion: 6.0.x
elementType: C N O H H C H H C F F F H
charge: 1
multiplicity: 1
keywords: wB97X-D3 def2-TZVPPD autoaux TightSCF
formula: C3H5F3NO
InChI: InChI=1/C3H5F3NO/c4-3(5,6)1-2-7-8/h2H,1,8H2
13 atoms
C  1.148267 1.158667 -0.097166
N  2.153993 0.491478 0.294115
O  2.018553 -0.963102 -0.169278
H  2.827565 -1.399654 0.156829
H  1.201157 -1.371506 0.221044
C  -0.060763 0.72816 -0.880978
H  -0.569821 1.608235 -1.27745
H  0.229568 0.089774 -1.721146
C  -1.05915 -0.032752 -0.012099
F  -2.103297 -0.430217 -0.708565
F  -1.452797 0.673387 1.037535
F  -0.453706 -1.179875 0.497152
H  1.252094 2.193956 0.232743
totalener: -546.56644279461341 hartree
nucrepener: 429.39761682334728 hartree
electener: -975.96406665630354 hartree
oneelecener: -1593.01804499551349 hartree
twoeener: 617.05397833920995 hartree
kineticenergy: 544.52288000150543 hartree
xcener: -45.509177990953 hartree
energy: -680.6772 -680.2307 -680.2254 -533.3022 -401.0778 -291.8575 -287.7160 -286.3275 -44.0672 -41.6998 -41.6173 -40.6927 -34.5470 -30.4986 -27.3435 -26.3797 -25.8572 -24.3702 -24.1364 -23.7947 -22.1887 -22.0399 -21.3082 -20.7662 -20.5785 -19.9839 -19.5234 -19.0486 -18.9622 -18.7704 -17.8636 -17.4484 -4.6583 -4.1946 -2.6180 -1.7215 -1.4560 -1.3030 -0.6550 -0.6058 -0.4558 -0.0234 0.0903 electronvolt
chargesum: 1.0000000
charge: 0.302812 -0.360773 0.057581 0.249136 0.318894 -0.273073 0.163676 0.238713 0.975303 -0.252387 -0.271072 -0.340355 0.191546
charge: 0.044046 0.249172 0.534177 -0.017849 -0.103815 0.138916 0.057798 0.058250 -0.555353 0.208451 0.194381 0.126446 0.065380
qa: 0.3028 -0.3608 0.0576 0.2491 0.3189 -0.2731 0.1637 0.2387 0.9753 -0.2524 -0.2711 -0.3404 0.1915
va: 3.5689 2.0393 2.6191 0.8860 0.9497 4.4678 1.0795 1.0000 3.2035 0.9765 0.9394 0.9008 0.9249
dispcorr: -0.003866778 hartree
energy: -546.570309572168
