program: Orca
programVersion: 6.0.x
elementType: C N O H H O H H C H H C H H F H
charge: 1
multiplicity: 1
keywords: wB97X-D3 def2-TZVPPD autoaux TightSCF
formula: C3H9FNO2
InChI: InChI=1/C3H7FNO.H2O/c4-2-1-3-5-6;/h3H,1-2,6H2;1H2
16 atoms
C  -0.120756 1.125568 -0.066747
N  1.027508 1.360935 0.429291
O  1.603665 0.074479 0.98637
H  2.257818 -0.333025 0.245611
H  2.121586 0.371691 1.753624
O  3.019569 -0.863947 -0.784013
H  3.653514 -0.345015 -1.292839
H  3.253511 -1.79728 -0.848236
C  -0.908856 -0.133784 -0.177163
H  -0.743052 -0.531782 -1.187823
H  -0.563817 -0.882598 0.537746
C  -2.411017 0.110546 -0.007669
H  -2.781332 0.853052 -0.721732
H  -2.656483 0.424447 1.010867
F  -3.051164 -1.084843 -0.256257
H  -0.528614 2.052364 -0.478723
totalener: -424.50900609887032 hartree
nucrepener: 316.39876061668713 hartree
electener: -740.90779804032695 hartree
oneelecener: -1198.42239090827047 hartree
twoeener: 457.51459286794358 hartree
kineticenergy: 422.74177902382513 hartree
xcener: -37.434370365748 hartree
energy: -677.4458 -531.7003 -529.8573 -399.7114 -286.5495 -285.6534 -284.6786 -39.2611 -39.1498 -37.1359 -33.1738 -28.9292 -25.3152 -24.9867 -24.4746 -23.7444 -21.7718 -21.4768 -20.5335 -20.0184 -19.5402 -19.4773 -18.5241 -18.0567 -17.8449 -16.8137 -16.2115 -15.6489 -15.5091 -3.4326 -3.1144 -2.2811 -1.7217 -1.3244 -1.1289 -0.6670 -0.5611 -0.2343 -0.1192 0.2729 electronvolt
chargesum: 1.0000000
charge: 0.244784 -0.507337 -0.040928 0.396675 0.227036 -0.258575 0.209706 0.205295 0.072831 0.196752 0.188087 -0.177563 0.204500 0.195029 -0.307920 0.151628
charge: 0.007863 0.196936 0.432014 -0.215424 -0.048124 0.612216 -0.104505 -0.105100 0.042468 0.051243 0.029252 -0.048677 0.040623 0.043399 0.008816 0.057001
qa: 0.2448 -0.5073 -0.0409 0.3967 0.2270 -0.2586 0.2097 0.2053 0.0728 0.1968 0.1881 -0.1776 0.2045 0.1950 -0.3079 0.1516
va: 3.5304 1.8997 2.3457 0.8555 0.9509 2.1815 0.9992 0.9959 3.6785 1.0055 0.9898 3.7350 1.0251 1.0339 0.8808 0.9603
dispcorr: -0.004226470 hartree
energy: -424.513232569174
