program: Orca
programVersion: 6.0.x
elementType: C N O H H O H H C H H C H H H H
charge: 1
multiplicity: 1
keywords: wB97X-D3 def2-TZVPPD autoaux TightSCF
formula: C3H10NO2
InChI: InChI=1/C3H8NO.H2O/c1-2-3-4-5;/h3H,2,5H2,1H3;1H2
16 atoms
C  -0.773325 0.748278 0.206566
N  0.372429 0.726164 0.761134
O  1.037222 -0.623787 0.491375
H  1.967878 -0.374719 0.044154
H  1.216674 -0.984537 1.376899
O  3.20547 -0.020308 -0.506119
H  3.577341 0.864156 -0.412804
H  3.617385 -0.45798 -1.259309
C  -1.542965 -0.254228 -0.582886
H  -1.675183 0.179036 -1.582179
H  -0.983266 -1.18344 -0.691196
C  -2.923295 -0.499576 0.050318
H  -3.491958 0.429098 0.144659
H  -3.494237 -1.180048 -0.58345
H  -2.831962 -0.953344 1.039936
H  -1.236864 1.720176 0.398041
totalener: -325.26355437456107 hartree
nucrepener: 248.45215016491727 hartree
electener: -573.71568363219330 hartree
oneelecener: -925.14905533768479 hartree
twoeener: 351.43337170549148 hartree
kineticenergy: 323.77381985074669 hartree
xcener: -30.147194657214 hartree
energy: -531.4282 -529.5061 -399.4411 -286.2426 -284.3855 -283.3301 -38.9547 -36.7876 -32.9059 -28.6669 -25.0577 -24.7712 -24.1063 -23.4152 -21.3803 -21.1233 -20.0406 -18.9669 -18.4937 -17.7541 -17.5301 -16.9176 -16.3641 -15.9817 -15.7499 -3.1031 -2.9518 -2.1281 -1.5749 -1.1356 -1.0494 -0.5297 -0.4476 -0.1518 0.1022 0.4433 electronvolt
chargesum: 1.0000000
charge: 0.240185 -0.520317 -0.048260 0.419961 0.221756 -0.254285 0.202021 0.198324 0.206614 0.195068 0.144242 -0.783990 0.232993 0.183229 0.209995 0.152462
charge: -0.005473 0.195916 0.433902 -0.216944 -0.048441 0.604783 -0.109059 -0.110040 -0.014454 0.038083 0.015037 0.161066 -0.000604 0.000214 -0.000305 0.056318
qa: 0.2402 -0.5203 -0.0483 0.4200 0.2218 -0.2543 0.2020 0.1983 0.2066 0.1951 0.1442 -0.7840 0.2330 0.1832 0.2100 0.1525
va: 3.4867 1.9507 2.3536 0.8208 0.9872 2.1560 1.0054 0.9987 3.3992 1.0238 1.0348 3.9074 1.0357 1.1013 1.0707 0.9746
dispcorr: -0.003717981 hartree
energy: -325.267272355472
