program: Orca
programVersion: 6.0.x
elementType: C N O H H O H H C H H H H
charge: 1
multiplicity: 1
keywords: wB97X-D3 def2-TZVPPD autoaux TightSCF
formula: C2H8NO2
InChI: InChI=1/C2H6NO.H2O/c1-2-3-4;/h2H,4H2,1H3;1H2
13 atoms
C  -1.442259 0.538742 -0.303274
N  -0.307396 0.953015 0.099626
O  0.440343 -0.193097 0.767213
H  1.389137 -0.208861 0.278649
H  0.577522 0.103019 1.684092
O  2.629788 -0.183416 -0.344649
H  2.945641 0.590104 -0.825842
H  3.097758 -0.964898 -0.659654
C  -2.112682 -0.782863 -0.218859
H  -3.072658 -0.653004 0.290641
H  -2.341618 -1.120818 -1.234622
H  -1.518203 -1.534908 0.295487
H  -1.966833 1.364532 -0.789802
totalener: -285.94510718200348 hartree
nucrepener: 186.64999048932265 hartree
electener: -472.59509336147624 hartree
oneelecener: -750.60953727358321 hartree
twoeener: 278.01444391210697 hartree
kineticenergy: 284.68789831677526 hartree
xcener: -25.975586672333 hartree
energy: -531.5354 -529.6112 -399.5450 -286.4557 -284.3966 -39.0801 -36.8967 -33.0116 -28.0189 -24.8808 -24.5370 -23.5170 -21.6368 -21.1286 -20.0697 -19.0870 -18.7269 -17.7925 -17.6372 -16.4777 -16.1404 -3.1939 -2.9993 -2.1615 -1.6283 -1.2402 -1.0819 -0.5016 -0.2566 -0.0901 0.0910 0.6121 electronvolt
chargesum: 1.0000000
charge: 0.472979 -0.497269 -0.041460 0.420972 0.220446 -0.247619 0.204434 0.201423 -0.475685 0.198765 0.192202 0.165444 0.185367
charge: -0.023193 0.184612 0.428735 -0.217808 -0.047247 0.610816 -0.106676 -0.107593 0.201776 0.016753 0.016539 -0.005976 0.049261
qa: 0.4730 -0.4973 -0.0415 0.4210 0.2204 -0.2476 0.2044 0.2014 -0.4757 0.1988 0.1922 0.1654 0.1854
va: 3.2611 2.0610 2.3533 0.8193 0.9976 2.1664 1.0051 0.9972 3.8795 1.0394 1.0430 1.0328 0.9512
dispcorr: -0.002607384 hartree
energy: -285.947714565736
