program: Gaussian 09
title: 000052772
version: EM64L-G09RevD.01
frameworkgroup: C1[X(C21H24N2O)]
method: RPBEPBE
basis: SDD
operation: Freq
keyword: #p
keyword: freq=noraman
keyword: PBEPBE/SDD
title: #p freq=noraman PBEPBE/SDD
converged: YES YES NO NO
title: Mulliken charges:
elementType: O N N C C C C C C C C C C C C C C C C C C C C C H H H H H H H H H H H H H H H H H H H H H H H H
charge: -0.453664 -0.154848 -0.106303 0.310278 -0.289234 -0.785453 -0.745720 0.481817 -0.343584 -0.442632 -0.172231 -0.208371 0.498373 -0.396657 -0.446701 -0.574104 -0.357172 -0.570128 0.485492 -0.378025 -0.421183 -0.224366 -0.225609 -0.254580 0.207819 0.263915 0.222645 0.237418 0.239157 0.213257 0.245520 0.265177 0.227277 0.263148 0.279016 0.352522 0.225619 0.209666 0.254849 0.230570 0.219016 0.213700 0.240592 0.247281 0.228678 0.239712 0.220873 0.227178
chargesum: 0.00000
title: Mulliken charges with hydrogens summed into heavy atoms:
elementType: O N N C C C C C C C C C C C C C C C C C C C C C
charge: -0.101142 -0.154848 -0.106303 0.310278 -0.081415 -0.061474 -0.047786 0.481817 -0.078407 -0.215355 0.090916 0.070645 0.498373 -0.141808 -0.216131 -0.138819 -0.116581 -0.137412 0.485492 -0.130745 -0.192505 0.015346 -0.004736 -0.027403
polarizability: 2.82342668e+02 8.15567314e+00 2.27258474e+02 9.62626914e+00 2.84107592e+01 1.73766963e+02
1716.lowfreq: -6.3574 -3.4691 -0.0006 0.0002 0.0005 8.9514 17.5762 22.7880 29.7704
frequency: 15.7456 22.3755 29.7167 46.2938 51.0038 67.4700 92.9329 102.1800 112.0410 131.9249 191.8026 195.7121 211.0597 221.6857 251.3301 276.9518 285.7789 300.0491 320.5351 321.9441 344.0907 354.3104 360.5135 392.1313 404.3324 411.8593 415.3770 474.9060 496.1958 510.5692 548.4105 566.8764 578.3359 606.6117 617.1223 635.7407 643.3795 667.8400 706.9092 721.7602 725.3194 750.2961 759.0192 766.0544 786.6606 805.7933 832.6833 835.1872 854.6501 857.2410 872.9445 881.5170 904.7546 915.8597 926.7015 934.1167 935.3072 956.9152 976.1235 977.9456 984.9436 989.5438 990.2166 994.9222 1001.1369 1013.1192 1017.8520 1026.7134 1063.2635 1078.0701 1106.3815 1114.5914 1141.3008 1145.0923 1153.3755 1171.3993 1176.9898 1183.4352 1187.0744 1194.7029 1196.0327 1203.5136 1209.3383 1224.6005 1228.8189 1252.1128 1288.9453 1290.8768 1306.9989 1319.0762 1326.4586 1333.6870 1337.1773 1372.2572 1380.1395 1380.8781 1390.9349 1402.7864 1411.8665 1437.9722 1438.6938 1461.5909 1467.8517 1469.3392 1471.3843 1477.8503 1483.8325 1484.2607 1500.5796 1508.7041 1581.6688 1590.8467 1612.3033 1625.0317 2951.4608 2980.9698 2984.7052 2988.7014 2993.6802 3039.7023 3049.9057 3079.3165 3087.8625 3098.4149 3101.1778 3105.7671 3109.7038 3125.1017 3130.3742 3133.0978 3141.0221 3145.4756 3163.0583 3178.5593 3218.0791 3252.5902 3266.4008 3580.1248
redmass: 5.0295 4.7308 5.0003 4.0628 4.1948 4.1218 4.0155 5.1667 4.0561 5.0534 4.7964 3.1839 1.9043 1.6573 2.3074 2.6801 3.5512 2.6698 1.4706 1.6699 2.1175 2.4113 1.9058 3.2374 2.8411 3.3285 3.2380 3.6624 4.1277 3.6966 3.4076 3.7631 3.0836 2.9995 6.2919 5.3963 3.9672 3.2049 1.8133 1.2453 3.5654 3.3409 2.9560 1.9658 1.4139 2.4349 2.1890 1.3972 1.2677 1.3423 2.1607 5.2881 1.5507 2.3817 2.4801 1.7892 1.4452 1.4008 1.3984 3.5841 1.4079 4.1081 3.4941 1.5349 2.1591 1.8424 2.4815 2.1612 1.6861 1.5746 1.5766 1.4001 2.2196 1.2162 1.4306 1.0573 3.0482 1.4024 1.1343 1.5922 1.6027 1.6424 2.1421 1.6969 1.7931 1.6315 4.3905 1.3922 1.9412 1.3247 1.2867 1.4664 3.5515 1.8025 1.4188 6.7225 2.6555 1.2090 2.4718 3.0226 2.1710 1.0909 1.1298 1.1084 2.7089 1.1642 2.2146 1.0615 1.0636 2.6926 6.6166 5.9812 6.1651 6.3929 1.0843 1.0601 1.0375 1.0605 1.0362 1.1023 1.1023 1.0979 1.0987 1.0997 1.0986 1.0880 1.0870 1.0864 1.0961 1.0915 1.0900 1.0957 1.1012 1.0946 1.0937 1.0966 1.1060 1.0662
irintensity: 1.6020 0.0355 0.8607 0.3332 1.1166 1.9738 0.7497 1.0049 0.3720 0.2028 1.2376 7.5926 11.9261 12.9961 54.5880 8.0285 11.1698 30.6351 19.4806 0.2542 10.2375 4.0469 12.3604 1.4793 0.1060 4.0729 1.7435 0.9484 9.8846 3.3114 4.2386 7.8271 5.0476 26.3482 0.1176 0.5756 4.6876 39.4589 48.3847 51.6966 20.5668 2.8601 5.2101 26.1468 65.0331 47.6401 24.7022 4.6964 0.1978 0.7873 4.2489 8.2019 2.7319 7.4792 0.3925 15.0752 1.5753 0.4875 0.5884 40.3167 0.0735 0.0523 18.4045 0.6877 0.3123 17.3286 7.5931 6.2919 32.5339 17.4647 11.4006 8.2149 1.0253 14.7533 30.5333 0.9561 8.1669 3.6112 1.0035 22.2769 18.1518 11.1859 1.1351 27.8477 2.8094 15.1212 5.9598 1.2741 19.1522 4.2069 1.1497 2.0317 3.0446 13.0542 25.1506 0.8437 4.4945 23.8690 8.3591 28.1109 9.7384 6.2731 8.5243 6.7930 2.5151 0.6045 15.7503 8.4871 13.6369 17.6011 0.7537 1.0324 3.7620 4.2839 41.0013 22.7372 26.5650 55.3193 22.0920 27.0733 34.4435 8.9405 42.4429 14.1135 33.1327 5.8936 8.9622 5.2968 30.8169 13.4881 7.8861 48.6801 15.4898 1.4860 7.2143 0.2793 2.0273 8.2619
temp: 298.150 k
press: 1.00000 atm
elementType: 8 7 7 6 6 6 6 6 6 6 6 6 6 6 6 6 6 6 6 6 6 6 6 6 1 1 1 1 1 1 1 1 1 1 1 1 1 1 1 1 1 1 1 1 1 1 1 1
symmnumber: 1
zpe: 1047143.2 jmol-1
zpe.correction: 0.398836 hartree
zpe.thermalcorrener: 0.421054 hartree
zpe.thermalcorrenthalpy: 0.421998 hartree
zpe.thermalcorrgfe: 0.345714 hartree
zpe.sumelectzpe: -997.602531 hartree
zpe.sumelectthermal: -997.580313 hartree
zpe.sumelectthermalent: -997.579369 hartree
zpe.sumelectthermalfe: -997.655654 hartree
dipole: -3.6320 -4.0560 -2.1417
dipole: 5.8506
quadrupole: -113.3902 -151.0447 -141.8771
quadrupole: 3.2428 3.4143 3.2922
quadrupole: 22.0471 -15.6074 -6.4398 3.2428 3.4143 3.2922
hfenergy: -998.0013671 hartree
pointgroup: C01 [X(C21H24N2O1)]
dipole: 1.1396505 -1.7666514 0.9372221 debye
polarizability: 277.7957903|-12.7676154|230.1186531|13.66787|-30.6816542|175.4536618 unknown
InChI: InChI=1S/C21H24N2O/c1-21(2,23-15-14-22-16-23)20(24)19-12-10-18(11-13-19)9-8-17-6-4-3-5-7-17/h3-7,10-16,20,24H,8-9H2,1-2H3
charge 0 multiplicity 1
48 atoms
O  3.264403 -1.000408 -1.78106
N  2.610602 0.845393 0.616758
N  1.717276 2.773733 -0.202632
C  3.417898 -0.410523 0.66791
C  2.906367 -1.449768 -0.423762
C  3.309011 -1.052766 2.068548
C  4.904003 -0.058716 0.390558
C  1.404111 -1.684506 -0.40151
C  0.537228 -0.915563 -1.215596
C  0.843147 -2.673137 0.4440
C  1.755932 1.35608 1.608935
C  2.545745 1.740251 -0.45629
C  -1.43228 -2.062109 -0.276927
C  -0.857725 -1.110004 -1.159073
C  -0.55626 -2.851229 0.511904
C  -2.939231 -2.2110 -0.142203
C  1.223363 2.536978 1.090733
C  -3.578559 -1.178126 0.85613
C  -3.645633 0.239495 0.306451
C  -2.588859 1.165097 0.509065
C  -4.762536 0.651051 -0.46819
C  -2.638208 2.458954 -0.058433
C  -4.821398 1.946494 -1.029828
C  -3.755589 2.855052 -0.828883
H  3.433462 -2.400723 -0.190045
H  2.275466 -1.354038 2.305692
H  3.946096 -1.954136 2.111261
H  3.665184 -0.354201 2.845692
H  5.023667 0.513786 -0.544157
H  5.515334 -0.979113 0.326413
H  5.304796 0.559887 1.211666
H  0.963131 -0.178892 -1.901372
H  1.49867 -3.318883 1.04241
H  1.603565 0.865867 2.564293
H  3.075065 1.574935 -1.389617
H  4.231913 -1.148184 -1.927257
H  -3.432081 -2.092647 -1.125774
H  -3.179557 -3.228454 0.222596
H  -1.511816 -0.502986 -1.794376
H  -0.973487 -3.618631 1.175997
H  -3.000463 -1.202477 1.799242
H  -4.601165 -1.531846 1.091524
H  0.53309 3.229776 1.567954
H  -1.711361 0.867622 1.09528
H  -5.592981 -0.048941 -0.628568
H  -1.79809 3.1468 0.088207
H  -5.694358 2.247069 -1.620981
H  -3.794086 3.857887 -1.269082
