program: Orca
programVersion: 6.0.x
elementType: C N O H H H H
charge: 1
multiplicity: 1
keywords: wB97X-D3 def2-TZVPPD autoaux TightSCF
formula: CH4NO
InChI: InChI=1/CH4NO/c1-2-3/h1,3H2
7 atoms
C  -1.22091 -0.145046 0.067582
N  -0.219806 0.464602 -0.397084
O  1.048108 -0.424881 -0.044826
H  1.479971 -0.615278 -0.901869
H  1.644353 0.161001 0.463452
H  -1.206697 -1.093641 0.601577
H  -2.155395 0.387247 -0.121914
totalener: -170.12238557670068 hartree
nucrepener: 75.51477692191760 hartree
electener: -245.63717747048534 hartree
oneelecener: -373.94271470383245 hartree
twoeener: 128.30553723334711 hartree
kineticenergy: 169.40419081405972 hartree
xcener: -15.274593185747 hartree
energy: -533.6296 -401.5587 -287.7844 -40.8862 -34.8565 -26.5837 -26.4766 -24.2790 -22.3761 -20.9619 -18.9650 -18.1682 -5.1304 -4.8832 -3.3726 -1.9960 -1.7968 -1.2238 -0.5718 -0.1539 0.1203 0.4748 0.8874 electronvolt
chargesum: 1.0000000
charge: 0.300942 -0.262629 0.049061 0.275830 0.275226 0.193823 0.167746
charge: 0.242987 0.209046 0.527728 -0.025627 -0.025791 0.034398 0.037259
qa: 0.3009 -0.2626 0.0491 0.2758 0.2752 0.1938 0.1677
va: 3.5743 2.3222 2.5693 0.9464 0.9468 0.9416 0.9625
dispcorr: -0.000617016 hartree
energy: -170.123002593156
