program: Orca
programVersion: 6.0.x
elementType: C N O H H H H O H H
charge: 1
multiplicity: 1
keywords: wB97X-D3 def2-TZVPPD autoaux TightSCF
formula: CH6NO2
InChI: InChI=1/CH4NO.H2O/c1-2-3;/h1,3H2;1H2
10 atoms
C  -1.893064 -0.30608 -0.535999
N  -0.964319 0.493974 -0.220395
O  -0.056362 -0.216731 0.750807
H  0.938139 -0.17371 0.311307
H  -0.065083 0.332248 1.555632
H  -1.998853 -1.316238 -0.144772
H  -2.608233 0.101184 -1.24778
O  2.167574 -0.110289 -0.238217
H  2.41489 0.561781 -0.884379
H  2.761687 -0.86607 -0.313955
totalener: -246.61112939535138 hartree
nucrepener: 128.71915826009797 hartree
electener: -375.33028538366409 hartree
oneelecener: -583.87175176955020 hartree
twoeener: 208.54146638588608 hartree
kineticenergy: 245.58428598589930 hartree
xcener: -21.796240480687 hartree
energy: -531.8680 -530.0081 -400.1320 -286.6171 -39.4659 -37.2998 -33.3199 -25.5193 -25.2072 -23.9102 -23.1711 -21.3557 -20.6541 -19.1217 -18.0339 -17.5485 -16.6650 -3.8814 -3.1133 -2.3992 -1.8853 -1.3236 -1.1239 -0.4311 -0.3623 -0.0740 0.3872 0.7539 electronvolt
chargesum: 1.0000000
charge: 0.242424 -0.388776 -0.004282 0.391232 0.220533 0.188355 0.162603 -0.235963 0.212987 0.210888
charge: 0.222644 0.148423 0.418088 -0.222269 -0.048441 0.024030 0.021150 0.632931 -0.098121 -0.098436
qa: 0.2424 -0.3888 -0.0043 0.3912 0.2205 0.1884 0.1626 -0.2360 0.2130 0.2109
va: 3.5828 2.2960 2.2879 0.8652 1.0059 0.9438 0.9688 2.1900 0.9937 0.9894
dispcorr: -0.001592419 hartree
energy: -246.612721814574
