program: Orca
programVersion: 6.0.x
elementType: C N C H H C H H O C H H H O C H H H
charge: 1
multiplicity: 1
keywords: wB97X-D3 def2-TZVPPD autoaux TightSCF
formula: C5H10NO2
InChI: InChI=1/C5H10NO2/c1-7-4-3-6-5-8-2/h4-5H2,1-2H3
18 atoms
C  0.193469 0.456083 -0.536467
N  -0.11344 0.507105 0.563879
C  -0.446805 0.505539 1.973999
H  -1.486377 0.152189 2.037678
H  -0.387122 1.552089 2.305957
C  0.570595 0.382082 -1.960776
H  0.722771 1.416977 -2.310255
H  1.541899 -0.139689 -2.000416
O  -0.457537 -0.286129 -2.603985
C  -0.209966 -0.457026 -4.004389
H  0.69214 -1.057316 -4.165797
H  -1.078042 -0.983223 -4.39536
H  -0.112222 0.515308 -4.49975
O  0.466924 -0.326285 2.573467
C  0.243873 -0.463831 3.982111
H  -0.743604 -0.896754 4.175756
H  1.016783 -1.141769 4.337013
H  0.341319 0.504176 4.485467
totalener: -401.45970147653912 hartree
nucrepener: 356.69969158343707 hartree
electener: -758.15938512466380 hartree
oneelecener: -1240.20846876575933 hartree
twoeener: 482.04908364109554 hartree
kineticenergy: 399.59163442603608 hartree
xcener: -37.684397877083 hartree
energy: -528.4143 -528.3222 -400.5468 -288.5966 -287.8285 -287.3739 -284.7527 -284.7360 -37.0071 -36.5744 -35.5724 -29.8197 -28.7285 -25.7071 -25.5105 -23.2464 -22.2601 -21.9219 -21.6716 -21.0204 -20.8828 -19.1745 -19.0640 -18.3799 -18.1629 -17.9867 -17.6650 -16.2514 -16.2402 -14.5711 -14.4929 -3.9611 -3.6796 -2.1321 -1.3659 -0.9301 -0.8254 -0.5967 -0.1785 -0.1221 0.0829 0.1373 electronvolt
chargesum: 1.0000000
charge: 0.153707 0.082389 0.016251 0.242592 0.225978 0.092645 0.220203 0.218505 -0.330252 -0.342490 0.195824 0.155017 0.194364 -0.327876 -0.344112 0.198906 0.145407 0.202943
charge: 0.224031 0.310444 -0.057190 0.073409 0.071919 -0.033875 0.068975 0.070653 -0.087490 0.155996 0.018346 0.021459 0.018243 -0.067861 0.156489 0.017841 0.020788 0.017822
qa: 0.1537 0.0824 0.0163 0.2426 0.2260 0.0926 0.2202 0.2185 -0.3303 -0.3425 0.1958 0.1550 0.1944 -0.3279 -0.3441 0.1989 0.1454 0.2029
va: 3.6440 3.6846 3.6237 0.9797 1.0027 3.7602 1.0065 1.0147 1.6690 3.8375 1.0070 1.0234 1.0054 1.7609 3.8200 1.0055 1.0317 0.9994
dispcorr: -0.003487791 hartree
energy: -401.463189267356
