program: Gaussian 09
title: 000052702
version: EM64L-G09RevD.01
frameworkgroup: C1[X(C9H16N2O3)]
method: RPBEPBE
basis: SDD
operation: Freq
keyword: #p
keyword: freq=noraman
keyword: PBEPBE/SDD
title: #p freq=noraman PBEPBE/SDD
converged: NO YES NO NO
title: Mulliken charges:
elementType: O O O N N C C C C C C C C C H H H H H H H H H H H H H H H H
charge: -0.281174 -0.333236 -0.372300 -0.375842 -0.311353 -0.163457 -0.435447 -0.429929 -0.393006 -0.391012 -0.387501 0.216873 -0.450817 0.288964 0.197277 0.230658 0.202989 0.205138 0.224175 0.202186 0.189661 0.190411 0.203355 0.200054 0.195623 0.331679 0.257110 0.262156 0.344439 0.382326
chargesum: 0.00000
title: Mulliken charges with hydrogens summed into heavy atoms:
elementType: O O O N N C C C C C C C C C
charge: -0.281174 -0.333236 0.010025 -0.044163 0.033086 0.033819 -0.001799 -0.000617 -0.001159 0.002754 0.008176 0.216873 0.068449 0.288964
polarizability: 1.53807599e+02 -4.70204814e+00 1.05771033e+02 4.22753824e+00 5.66366716e+00 1.03453356e+02
1716.lowfreq: -37.1260 -12.5015 -6.2221 -0.0007 -0.0006 0.0004 13.2542 20.8186 41.3699
frequency: -31.1685 6.9645 39.4301 56.2552 93.7300 148.3690 200.7684 209.0788 217.3898 245.4059 256.7916 293.0704 313.7630 350.8046 381.2304 414.6754 429.0999 472.9153 491.0218 509.7114 597.6669 607.1408 682.6974 705.8348 751.4348 786.8169 793.6089 844.4095 881.9141 891.1421 914.0977 921.8924 926.9086 977.9657 994.7141 1029.2963 1047.5245 1054.7397 1069.0912 1087.2573 1112.4304 1145.5850 1177.1551 1188.1268 1197.6861 1246.0896 1249.1616 1252.7539 1267.1098 1295.5472 1312.1187 1321.3452 1331.5158 1335.4750 1340.0332 1348.8024 1359.8804 1369.3533 1454.2801 1461.3891 1463.0153 1464.7227 1471.8659 1477.5184 1479.1056 1503.4357 1572.8559 1608.8450 2954.7739 2963.8172 2965.6916 2969.7596 2975.4516 2981.0112 2986.4507 3026.7877 3029.3922 3036.2644 3044.6280 3052.7341 3053.7685 3271.6261 3542.5739 3615.0720
redmass: 3.7319 6.9067 5.6276 6.2734 3.3308 4.8008 6.0919 3.0007 2.0860 3.4104 5.2105 4.1832 3.1924 2.1519 1.8256 2.1133 3.0230 1.1358 1.8351 2.0414 2.1233 1.3823 4.4447 6.2987 3.6645 1.4600 2.8260 2.1531 1.8032 1.5552 2.8184 1.9079 4.9559 3.3848 3.2249 2.7769 1.3668 1.7974 1.3106 2.7047 2.3536 2.6068 1.4224 1.2431 1.7982 1.3896 1.2573 1.3130 1.2782 1.2208 1.3128 1.3611 1.4018 1.3767 1.4853 1.5761 1.5788 2.1678 1.1111 1.0869 1.0862 1.0872 1.0894 1.4930 1.3418 1.9095 4.2059 6.2550 1.0828 1.0636 1.0625 1.0626 1.0637 1.0606 1.0618 1.0978 1.0944 1.1031 1.1036 1.0968 1.1025 1.0637 1.0778 1.0832
irintensity: 0.0679 5.8294 4.2661 6.1300 4.3265 3.4784 4.4504 3.0824 2.4903 17.2390 6.1069 8.4896 36.1461 16.1785 35.8413 10.9995 0.3845 236.2118 6.3572 7.9328 14.2837 124.1376 5.9023 0.5590 3.4936 0.0236 1.0840 9.9951 0.7796 10.5808 2.4675 0.6208 44.0084 49.1935 16.1874 21.7046 0.4293 0.9385 0.6812 14.2333 0.0752 4.8955 2.2743 51.7859 67.0773 8.9602 11.5629 0.2408 0.9730 4.5158 14.9482 3.2194 24.6635 0.6764 0.3384 24.9404 25.4891 157.8695 41.7856 4.4173 6.0998 13.1806 26.6715 148.7910 92.9673 73.0872 157.1577 99.5302 20.9766 35.5745 40.5190 32.9938 37.1828 32.0004 22.4545 78.8662 62.4110 22.4024 13.4828 10.7524 94.9730 25.0018 36.7296 78.1650
temp: 298.150 k
press: 1.00000 atm
elementType: 8 8 8 7 7 6 6 6 6 6 6 6 6 6 1 1 1 1 1 1 1 1 1 1 1 1 1 1 1 1
symmnumber: 1
zpe: 657788.4 jmol-1
zpe.correction: 0.250538 hartree
zpe.thermalcorrener: 0.264421 hartree
zpe.thermalcorrenthalpy: 0.265365 hartree
zpe.thermalcorrgfe: 0.207461 hartree
zpe.sumelectzpe: -686.601839 hartree
zpe.sumelectthermal: -686.587957 hartree
zpe.sumelectthermalent: -686.587012 hartree
zpe.sumelectthermalfe: -686.644917 hartree
dipole: 0.3810 -0.2298 0.7811
dipole: 0.8990
quadrupole: -83.3985 -86.1268 -86.8325
quadrupole: 8.9324 5.9472 -3.1010
quadrupole: 2.0541 -0.6742 -1.3799 8.9324 5.9472 -3.1010
hfenergy: -686.8523778 hartree
pointgroup: C01 [X(C9H16N2O3)]
dipole: -0.1746021 -0.1173043 -0.2843293 debye
polarizability: 154.1841399|4.0751029|104.5883024|-0.3044997|-6.1680408|104.2595455 unknown
InChI: InChI=1S/C9H16N2O3/c12-8(11-14)6-10-9(13)7-4-2-1-3-5-7/h7,10-11,14H,1-6H2
charge 0 multiplicity 1
30 atoms
O  -0.042404 -1.402424 1.27235
O  3.156263 0.60419 -1.796965
O  5.225515 1.020259 -0.156966
N  0.846618 -0.774734 -0.780729
N  4.234306 0.019037 0.129934
C  -1.509636 -0.199421 -0.29779
C  -2.700091 -1.172781 -0.084475
C  -1.727677 1.11296 0.515301
C  -4.048985 -0.502415 -0.434863
C  -3.075222 1.779859 0.155381
C  -4.258597 0.805901 0.36444
C  -0.193835 -0.84866 0.138052
C  2.193129 -1.242689 -0.453901
C  3.207438 -0.141862 -0.754793
H  -1.45572 0.064681 -1.376165
H  -2.695508 -1.493396 0.974938
H  -2.554761 -2.084468 -0.696183
H  -0.89048 1.814847 0.333323
H  -1.711227 0.855866 1.592481
H  -4.877548 -1.209526 -0.236873
H  -4.077284 -0.273252 -1.52083
H  -3.053938 2.108164 -0.904823
H  -3.214612 2.691007 0.768724
H  -5.209139 1.28839 0.065334
H  -4.344468 0.564077 1.443809
H  0.731658 -0.26168 -1.658028
H  2.462641 -2.133692 -1.056343
H  2.180593 -1.542437 0.609952
H  4.383198 -0.423541 1.035059
H  4.872575 1.396738 -1.027052
