program: Orca
programVersion: 6.0.x
elementType: C N C H H C H H C H H H O C H H H
charge: 1
multiplicity: 1
keywords: wB97X-D3 def2-TZVPPD autoaux TightSCF
formula: C5H10NO
InChI: InChI=1/C5H10NO/c1-3-4-6-5-7-2/h3,5H2,1-2H3
17 atoms
C  0.425546 0.162328 -1.157435
N  0.532456 -0.187924 -0.071131
C  0.595869 -0.53965 1.331864
H  0.356932 -1.610888 1.395607
H  1.635786 -0.371444 1.646372
C  0.26865 0.587622 -2.537764
H  -0.195059 1.58035 -2.495367
H  1.276244 0.712344 -2.95019
C  -0.575029 -0.400613 -3.366245
H  -1.57258 -0.522969 -2.941735
H  -0.676607 0.010163 -4.371504
H  -0.088226 -1.374176 -3.438985
O  -0.316288 0.274035 1.96131
C  -0.39892 0.024181 3.368788
H  0.567885 0.202518 3.852177
H  -1.134424 0.72923 3.749734
H  -0.735396 -1.000676 3.560435
totalener: -326.26162232452475 hartree
nucrepener: 286.86152911511624 hartree
electener: -613.12315605346430 hartree
oneelecener: -998.57494570781103 hartree
twoeener: 385.45178965434678 hartree
kineticenergy: 324.64665750769626 hartree
xcener: -31.599324217214 hartree
energy: -528.2677 -400.2777 -288.4661 -287.7389 -286.0593 -284.7028 -284.2685 -36.8902 -35.4655 -30.4747 -29.0597 -26.0444 -25.5710 -23.0899 -21.9539 -21.5447 -21.4460 -20.6533 -19.6177 -18.6997 -18.3363 -18.2385 -17.5905 -17.2939 -17.1262 -16.1935 -14.4393 -3.6370 -3.4893 -2.1849 -1.3395 -0.9639 -0.9037 -0.4547 -0.1990 -0.0773 0.1456 0.2232 electronvolt
chargesum: 1.0000000
charge: 0.109438 0.060471 0.020310 0.226722 0.232125 0.221250 0.174856 0.181244 -0.749026 0.235511 0.184214 0.231489 -0.330950 -0.343102 0.201584 0.145665 0.198197
charge: 0.152659 0.299026 -0.061933 0.070057 0.070406 0.028414 0.052375 0.050367 0.182883 0.005404 0.006103 0.004890 -0.069946 0.153878 0.017574 0.020444 0.017400
qa: 0.1094 0.0605 0.0203 0.2267 0.2321 0.2212 0.1749 0.1812 -0.7490 0.2355 0.1842 0.2315 -0.3309 -0.3431 0.2016 0.1457 0.1982
va: 3.7405 3.6429 3.6209 0.9936 0.9939 3.4775 1.0246 1.0160 3.8161 1.0399 1.0974 1.0494 1.7609 3.8187 0.9997 1.0307 1.0076
dispcorr: -0.003243457 hartree
energy: -326.264865782002
