program: Orca
programVersion: 6.0.x
elementType: C N C H H C C C C H C H C H H O C H H H O C H H H
charge: 1
multiplicity: 1
keywords: wB97X-D3 def2-TZVPPD autoaux TightSCF
formula: C10H12NO2
InChI: InChI=1/C10H12NO2/c1-12-8-11-7-9-3-5-10(13-2)6-4-9/h3-6H,8H2,1-2H3
25 atoms
C  -0.539469 -0.187326 1.238293
N  -0.767659 -0.186813 2.372612
C  -0.744743 -0.119816 3.805042
H  -1.080831 -1.099952 4.172998
H  -1.477429 0.645667 4.098022
C  -0.314619 -0.197052 -0.139212
C  -0.419416 1.005564 -0.869179
C  0.024176 -1.408735 -0.792421
C  -0.195047 1.005324 -2.229382
H  -0.673648 1.93116 -0.363983
C  0.244785 -1.403689 -2.145211
H  0.108538 -2.33138 -0.228837
C  0.137151 -0.200881 -2.879959
H  -0.277001 1.933316 -2.780271
H  0.504367 -2.311644 -2.67659
O  0.366934 -0.308419 -4.17796
C  0.289923 0.843781 -5.021593
H  1.035699 1.586535 -4.724796
H  0.509344 0.481032 -6.023037
H  -0.715712 1.272908 -4.99605
O  0.548086 0.19089 4.176163
C  0.695751 0.300033 5.59217
H  0.458729 -0.650589 6.083889
H  1.740852 0.547886 5.765667
H  0.057596 1.097287 5.990852
totalener: -593.24197663036000 hartree
nucrepener: 712.05829569504783 hartree
electener: -1305.30028386926188 hartree
oneelecener: -2201.82817718170782 hartree
twoeener: 896.52789331244583 hartree
kineticenergy: 590.41781682549424 hartree
xcener: -56.929279437264 hartree
energy: -528.2369 -527.6723 -399.1534 -287.4935 -287.0128 -285.9924 -284.9780 -284.6775 -284.5379 -284.3865 -284.2475 -283.8973 -283.7719 -36.4448 -36.1831 -34.5106 -31.1791 -28.9839 -28.1473 -28.0354 -26.3589 -25.1088 -24.3309 -23.8150 -22.4349 -21.9818 -21.1107 -20.9931 -20.6352 -20.3605 -19.3846 -19.0705 -18.6881 -18.6222 -18.4594 -17.8463 -17.7675 -17.6283 -17.0571 -16.9443 -16.3866 -15.6873 -15.5418 -15.3322 -13.8738 -13.7466 -12.6456 -4.0992 -2.7297 -2.4235 -1.6486 -0.9668 -0.7505 -0.6905 -0.5635 -0.3752 -0.2959 -0.0478 electronvolt
chargesum: 1.0000000
charge: 0.724102 -0.032972 -0.018787 0.222956 0.223282 0.095906 -0.653641 -0.415671 0.125046 0.085695 -0.283738 0.095482 1.038482 0.107113 0.135259 -0.444913 -0.472422 0.231992 0.138855 0.229874 -0.328027 -0.340709 0.196857 0.143143 0.196837
charge: 0.131294 0.280920 -0.077621 0.067671 0.066990 -0.164504 0.095537 0.092707 0.105337 0.034983 0.118895 0.033820 -0.207531 0.015962 0.036391 0.015098 0.171522 0.020915 0.022210 0.020322 -0.071578 0.141151 0.015716 0.018269 0.015530
qa: 0.7241 -0.0330 -0.0188 0.2230 0.2233 0.0959 -0.6536 -0.4157 0.1250 0.0857 -0.2837 0.0955 1.0385 0.1071 0.1353 -0.4449 -0.4724 0.2320 0.1389 0.2299 -0.3280 -0.3407 0.1969 0.1431 0.1968
va: 1.9939 3.5275 3.5960 0.9985 0.9959 0.9972 3.0306 2.8921 3.1057 1.0136 3.5430 1.0098 2.4638 0.9205 0.9887 1.6686 3.8196 0.9480 1.0560 0.9437 1.7479 3.8162 1.0079 1.0295 1.0077
dispcorr: -0.006847570 hartree
energy: -593.248824200353
