program: Orca
programVersion: 6.0.x
elementType: C N C H H C H H O C H H H C F F F
charge: 1
multiplicity: 1
keywords: wB97X-D3 def2-TZVPPD autoaux TightSCF
formula: C5H7F3NO
InChI: InChI=1/C5H7F3NO/c1-10-3-2-9-4-5(6,7)8/h3-4H2,1H3
17 atoms
C  0.052105 0.486935 -1.031509
N  -0.330149 0.617584 0.038878
C  -0.781037 0.758198 1.386348
H  -1.719185 0.208116 1.490767
H  -0.93797 1.81965 1.589816
C  0.515975 0.308972 -2.422087
H  0.887972 1.288923 -2.766078
H  1.369409 -0.38938 -2.383357
O  -0.57531 -0.165721 -3.128871
C  -0.277626 -0.399079 -4.512317
H  0.514088 -1.149229 -4.613642
H  -1.199259 -0.775201 -4.950918
H  0.01462 0.53445 -5.004969
C  0.27726 0.186323 2.345367
F  -0.158009 0.339099 3.587898
F  1.437177 0.832093 2.193454
F  0.480695 -1.10935 2.096235
totalener: -624.03043090626852 hartree
nucrepener: 542.34676548371340 hartree
electener: -1166.37722246324256 hartree
oneelecener: -1920.12276531594898 hartree
twoeener: 753.74554285270654 hartree
kineticenergy: 621.56735335531846 hartree
xcener: -53.465123887671 hartree
energy: -679.7085 -679.7073 -679.7042 -528.6579 -401.1516 -291.3260 -289.0804 -287.6643 -287.4163 -284.9435 -43.5211 -41.0731 -41.0030 -36.9483 -36.5218 -31.2244 -29.3318 -26.7434 -25.7623 -24.4989 -23.6922 -23.6592 -22.8265 -22.3580 -22.1026 -21.5268 -21.0854 -20.0160 -19.8825 -19.8374 -19.0989 -18.9263 -18.6445 -18.3908 -18.3537 -18.1272 -17.5199 -16.4700 -14.8040 -4.4352 -4.0438 -2.3666 -1.5300 -1.0107 -0.9938 -0.7435 -0.3235 -0.2360 -0.1468 0.0478 electronvolt
chargesum: 1.0000000
charge: 0.181456 0.090322 -0.264918 0.205004 0.200917 0.069065 0.222189 0.219675 -0.332171 -0.349212 0.197066 0.157163 0.196764 0.995851 -0.256323 -0.267468 -0.265381
charge: 0.237154 0.285392 0.146505 0.075420 0.073376 -0.029661 0.070788 0.071718 -0.087427 0.160820 0.019002 0.022205 0.018945 -0.598380 0.191349 0.170179 0.172616
qa: 0.1815 0.0903 -0.2649 0.2050 0.2009 0.0691 0.2222 0.2197 -0.3322 -0.3492 0.1971 0.1572 0.1968 0.9959 -0.2563 -0.2675 -0.2654
va: 3.6229 3.6948 3.8913 0.9945 0.9989 3.7547 1.0068 1.0131 1.6631 3.8393 1.0043 1.0219 1.0048 3.3301 0.9517 0.9513 0.9546
dispcorr: -0.004059885 hartree
energy: -624.034490791566
