program: Orca
programVersion: 6.0.x
elementType: C N C H H C H H C F F F C F F F
charge: 1
multiplicity: 1
keywords: wB97X-D3 def2-TZVPPD autoaux TightSCF
formula: C5H4F6N
InChI: InChI=1/C5H4F6N/c6-4(7,8)1-2-12-3-5(9,10)11/h1,3H2
16 atoms
C  0.27268 -0.198832 -0.492398
N  -0.306318 -0.207671 0.494303
C  -0.985996 -0.209822 1.751818
H  -1.735939 0.584303 1.737399
H  -1.461951 -1.184217 1.883456
C  0.985115 -0.187314 -1.758751
H  1.728826 0.616653 -1.735236
H  1.493643 -1.149327 -1.884366
C  0.001083 0.041685 -2.928616
F  0.676908 0.03774 -4.065173
F  -0.917561 -0.927588 -2.948225
F  -0.621361 1.213358 -2.779084
C  0.033725 0.040445 2.878254
F  -0.610577 0.026633 4.035026
F  0.63039 1.222793 2.707781
F  0.971387 -0.910597 2.872536
totalener: -846.60674351260093 hartree
nucrepener: 748.78522805430089 hartree
electener: -1595.39200060888129 hartree
oneelecener: -2641.30185921640350 hartree
twoeener: 1045.90985860752221 hartree
kineticenergy: 843.54811414296648 hartree
xcener: -69.248075421868 hartree
energy: -680.0474 -680.0441 -680.0243 -679.9107 -679.9055 -679.8994 -401.5371 -291.7871 -291.5397 -289.5864 -287.6630 -287.2603 -43.8727 -43.7245 -41.4115 -41.3528 -41.2756 -41.2067 -37.0599 -31.9184 -30.8708 -27.0866 -26.7238 -24.7996 -24.2445 -24.0164 -23.9990 -23.8921 -23.7445 -22.8544 -22.4753 -22.1205 -21.2156 -20.4618 -20.2655 -20.1843 -20.1458 -20.0641 -19.3021 -19.2192 -19.1286 -19.0640 -18.6823 -18.5969 -18.5281 -18.2555 -17.6297 -4.7808 -4.4598 -2.5487 -1.7005 -1.1793 -1.1080 -0.7283 -0.5539 -0.4328 -0.3491 -0.0896 electronvolt
chargesum: 1.0000000
charge: 0.184961 0.107199 -0.274008 0.202332 0.201305 -0.160130 0.191104 0.193904 0.912777 -0.244442 -0.264423 -0.262869 0.996582 -0.254133 -0.264566 -0.265594
charge: 0.189874 0.293299 0.152569 0.075601 0.075024 0.178753 0.074510 0.073915 -0.605630 0.199069 0.175507 0.176493 -0.598732 0.194789 0.172852 0.172106
qa: 0.1850 0.1072 -0.2740 0.2023 0.2013 -0.1601 0.1911 0.1939 0.9128 -0.2444 -0.2644 -0.2629 0.9966 -0.2541 -0.2646 -0.2656
va: 3.5933 3.6943 3.9073 0.9973 0.9949 4.4119 1.0355 1.0313 3.3677 0.9675 0.9529 0.9569 3.3201 0.9555 0.9527 0.9516
dispcorr: -0.004632460 hartree
energy: -846.611375972653
