program: Orca
programVersion: 6.0.x
elementType: C N C H H C H H C H H F C F F F
charge: 1
multiplicity: 1
keywords: wB97X-D3 def2-TZVPPD autoaux TightSCF
formula: C5H6F4N
InChI: InChI=1/C5H6F4N/c6-2-1-3-10-4-5(7,8)9/h1-2,4H2
16 atoms
C  0.446985 0.067591 -1.077137
N  0.461608 0.513175 -0.020687
C  0.468913 1.001758 1.321848
H  -0.109622 1.927569 1.357512
H  1.504279 1.189784 1.614821
C  0.419354 -0.48076 -2.416308
H  1.457046 -0.595918 -2.751482
H  -0.031601 -1.478554 -2.349796
C  -0.374009 0.398753 -3.415765
H  0.08309 1.385503 -3.524022
H  -1.421662 0.490408 -3.118833
F  -0.305873 -0.256292 -4.614528
C  -0.161122 -0.049091 2.252832
F  -0.138602 0.422028 3.491127
F  -1.42264 -0.294328 1.887956
F  0.524925 -1.193236 2.193888
totalener: -648.07370334075381 hartree
nucrepener: 537.18060152461783 hartree
electener: -1185.25431386449600 hartree
oneelecener: -1944.93639807337081 hartree
twoeener: 759.68208420887481 hartree
kineticenergy: 645.58548693810133 hartree
xcener: -54.663031017293 hartree
energy: -679.8140 -679.8136 -679.8095 -678.5417 -401.2205 -291.4288 -289.2925 -287.5366 -286.9748 -286.6215 -43.6263 -41.1786 -41.1101 -40.3278 -36.7946 -31.5813 -30.4597 -26.9068 -26.3068 -24.5980 -23.7997 -23.7717 -22.9153 -22.5067 -22.1918 -21.8475 -20.9352 -20.4270 -20.1773 -20.0667 -19.9642 -19.3073 -19.0460 -18.9736 -18.4939 -18.4221 -17.6142 -16.8773 -16.6367 -4.4113 -4.2545 -2.5831 -1.6154 -1.2950 -1.1390 -0.8663 -0.4453 -0.3871 -0.2949 -0.1477 electronvolt
chargesum: 1.0000000
charge: 0.123026 0.060473 -0.256111 0.201361 0.207854 0.087075 0.183101 0.175374 -0.140095 0.222224 0.224048 -0.281514 0.981242 -0.254968 -0.267210 -0.265881
charge: 0.170422 0.278562 0.143858 0.072988 0.073329 0.097807 0.062381 0.063836 -0.026962 0.046735 0.047217 0.033799 -0.598859 0.192202 0.170737 0.171947
qa: 0.1230 0.0605 -0.2561 0.2014 0.2079 0.0871 0.1831 0.1754 -0.1401 0.2222 0.2240 -0.2815 0.9812 -0.2550 -0.2672 -0.2659
va: 3.8511 3.6743 3.9010 0.9963 0.9879 3.7897 1.0236 1.0285 3.6363 1.0197 1.0191 0.9210 3.3426 0.9537 0.9553 0.9542
dispcorr: -0.004136585 hartree
energy: -648.077839925701
