program: Gaussian 09
title: 000052695
version: EM64L-G09RevD.01
frameworkgroup: C1[X(C15H13ClO)]
method: RPBEPBE
basis: SDD
operation: Freq
keyword: #p
keyword: freq=noraman
keyword: PBEPBE/SDD
title: #p freq=noraman PBEPBE/SDD
converged: YES YES NO NO
title: Mulliken charges:
elementType: Cl O C C C C C C C C C C C C C C C H H H H H H H H H H H H H
charge: -0.030182 -0.188821 -0.760336 0.589682 0.311491 0.196322 -0.341819 -0.348398 0.441146 -0.420822 -0.361895 -0.402278 -0.382317 -0.224233 -0.215550 -0.803043 -0.237612 0.288454 0.236021 0.277047 0.234500 0.273054 0.234995 0.237334 0.230758 0.231510 0.230609 0.229158 0.242461 0.232764
chargesum: 0.00000
title: Mulliken charges with hydrogens summed into heavy atoms:
elementType: Cl O C C C C C C C C C C C C C C C
charge: -0.030182 -0.188821 -0.471883 0.589682 0.311491 0.196322 -0.105798 -0.071351 0.441146 -0.186323 -0.088840 -0.167283 -0.144983 0.006525 0.015960 -0.100814 -0.004848
polarizability: 2.10362939e+02 1.00635025e+00 1.72941985e+02 2.49200745e+00 1.78579996e+01 1.38843560e+02
1716.lowfreq: -11.1358 -5.4921 -2.5061 -0.0024 -0.0022 -0.0014 5.7587 16.2518 28.3242
frequency: -8.0289 15.7364 28.3067 38.8999 83.0771 94.5014 120.3893 146.6288 200.2010 230.8674 259.7800 286.1509 320.5267 344.3689 401.2828 402.5084 432.9514 479.9788 491.7132 544.2174 583.9573 613.4773 633.3108 676.7915 691.1916 703.9144 728.7952 781.6346 783.8240 800.0114 830.6920 846.9346 855.2160 862.3686 932.0405 960.3835 978.9236 982.9154 989.4207 994.6495 998.4812 1003.5299 1015.2738 1026.6065 1046.8487 1083.8231 1126.5236 1174.0655 1185.5540 1189.5428 1196.8437 1209.5816 1224.4207 1230.0834 1277.9218 1313.7099 1334.3519 1372.2761 1385.7958 1397.0127 1412.9039 1442.8493 1467.4407 1472.0923 1479.9851 1501.4047 1563.9825 1590.4917 1595.6194 1608.5053 1622.2214 2977.4304 3059.8580 3081.8118 3090.8681 3117.0234 3126.5349 3129.3938 3131.0005 3142.6540 3153.7682 3153.8804 3160.9017 3167.5245
redmass: 1.0688 4.4502 3.8230 3.9749 7.5129 5.2263 5.6699 7.4190 7.7174 4.5341 4.4592 6.6930 5.9995 3.3924 2.7991 2.8174 4.8346 3.4102 3.6378 5.9153 5.5121 6.4450 6.9201 5.2470 4.7042 1.6191 3.0245 4.4342 2.4589 2.0566 5.2912 1.7476 1.2514 1.6597 1.4649 1.3730 2.4536 1.4037 2.9091 2.0357 1.5711 1.4637 2.5047 2.1966 1.5974 1.6078 1.3169 1.0671 1.5411 1.1450 1.3203 1.6966 1.9697 2.2298 2.1631 1.2972 1.2839 4.6774 7.9614 1.2207 3.6484 2.1868 1.1052 1.0575 2.2416 2.5657 6.5424 6.5738 7.2630 6.0131 6.6832 1.0392 1.0941 1.0863 1.1001 1.0880 1.0883 1.0892 1.0867 1.0916 1.0961 1.0951 1.0958 1.1015
irintensity: 0.4177 0.7813 0.1631 0.1642 0.1718 0.1348 0.2422 4.6138 0.0587 3.3001 0.6771 4.7846 0.5203 3.2658 0.2548 0.3136 1.8169 6.2219 2.2515 36.5623 38.1882 2.9007 0.3442 36.2420 17.7821 119.4610 11.2889 9.8981 4.9852 17.8145 3.4869 7.3434 0.4329 24.8756 0.6776 1.0756 22.7886 0.9986 2.2417 8.1555 8.4857 3.8532 0.9667 7.7988 22.4450 9.8105 13.4337 0.9376 59.9946 33.2944 10.7445 69.9501 21.9640 1.3671 80.3734 6.6405 7.3533 6.0850 0.7881 15.1255 10.9483 12.2186 16.3705 12.8139 9.5134 0.4918 68.3459 24.8445 79.6463 5.4327 40.4607 22.6186 20.6529 12.6319 15.1158 7.4614 11.0708 17.2543 0.6734 17.1810 23.7085 10.9583 4.3444 21.9970
temp: 298.150 k
press: 1.00000 atm
elementType: 17 8 6 6 6 6 6 6 6 6 6 6 6 6 6 6 6 1 1 1 1 1 1 1 1 1 1 1 1 1
symmnumber: 1
zpe: 611261.4 jmol-1
zpe.correction: 0.232817 hartree
zpe.thermalcorrener: 0.247575 hartree
zpe.thermalcorrenthalpy: 0.248519 hartree
zpe.thermalcorrgfe: 0.187964 hartree
zpe.sumelectzpe: -1113.488151 hartree
zpe.sumelectthermal: -1113.473393 hartree
zpe.sumelectthermalent: -1113.472449 hartree
zpe.sumelectthermalfe: -1113.533004 hartree
dipole: -3.0720 -4.9909 -1.1339
dipole: 5.9692
quadrupole: -91.7287 -110.4019 -101.0643
quadrupole: -7.0825 1.2822 1.8060
quadrupole: 9.3363 -9.3369 0.0007 -7.0825 1.2822 1.8060
hfenergy: -1113.7209682 hartree
pointgroup: C01 [X(C15H13Cl1O1)]
dipole: 1.0499091 -1.9685984 0.7332529 debye
polarizability: 209.9494702|-3.2438771|167.8600115|2.6046984|-21.9905313|144.3390022 unknown
InChI: InChI=1S/C15H13ClO/c1-11-7-9-13(10-8-11)15(17)14(16)12-5-3-2-4-6-12/h2-10,14H,1H3
charge 0 multiplicity 1
30 atoms
Cl -2.143118 2.849731 0.498285
O  -0.027554 2.107293 -1.517544
C  -1.129719 1.233369 0.492521
C  -2.024158 0.059954 0.152103
C  1.30782 0.614701 -0.178466
C  0.059705 1.386598 -0.486158
C  1.407368 -0.342093 0.868308
C  2.451153 0.855101 -0.990365
C  3.760311 -0.790153 0.288503
C  -2.503451 -0.781217 1.188779
C  -2.399077 -0.207495 -1.190485
C  2.615417 -1.032148 1.092417
C  3.655216 0.169246 -0.755589
C  -3.339573 -1.87903 0.890406
C  -3.235888 -1.303959 -1.48663
C  5.050679 -1.5526 0.520273
C  -3.706323 -2.143986 -0.44941
H  -0.774506 1.169124 1.531826
H  0.543488 -0.572171 1.500104
H  2.365188 1.591721 -1.795996
H  -2.233275 -0.566891 2.230552
H  -2.043074 0.45012 -1.990791
H  2.674587 -1.769471 1.901734
H  4.529232 0.375639 -1.384738
H  -3.707573 -2.521341 1.698004
H  -3.523576 -1.503522 -2.524691
H  5.933053 -0.951639 0.239378
H  5.160436 -1.855555 1.576032
H  5.075538 -2.476112 -0.090813
H  -4.356026 -2.994812 -0.682851
