program: Orca
programVersion: 6.0.x
elementType: C N C H H H C F F F
charge: 1
multiplicity: 1
keywords: wB97X-D3 def2-TZVPPD autoaux TightSCF
formula: C3H3F3N
InChI: InChI=1/C3H3F3N/c1-7-2-3(4,5)6/h1H,2H2
10 atoms
C  0.00013 -2.644047 0.25025
N  0.000427 -1.657084 -0.318986
C  0.000919 -0.398559 -1.000735
H  -0.897404 -0.351131 -1.621329
H  0.900828 -0.350575 -1.618975
H  -0.00016 -3.582699 0.786699
C  -0.000784 0.743617 0.037519
F  0.00003 1.892936 -0.618174
F  1.08161 0.660815 0.812075
F  -1.08545 0.660514 0.808848
totalener: -470.15328725244683 hartree
nucrepener: 319.59556817224802 hartree
electener: -789.74885824236253 hartree
oneelecener: -1270.96445692443649 hartree
twoeener: 481.21559868207390 hartree
kineticenergy: 468.41151380161671 hartree
xcener: -39.017701775883 hartree
energy: -680.1558 -680.1557 -680.1502 -402.3519 -291.8376 -289.9690 -288.0656 -43.9882 -41.5345 -41.4680 -37.6437 -31.8633 -27.4354 -26.1950 -24.8726 -24.1741 -24.1712 -23.0821 -22.6696 -21.0206 -20.3927 -20.3365 -19.8106 -19.3811 -19.1160 -18.7821 -18.1465 -5.3341 -5.2254 -2.5774 -2.3447 -1.4307 -1.0027 -0.8186 -0.3566 -0.2267 -0.0259 0.3431 electronvolt
chargesum: 1.0000000
charge: 0.211816 0.223808 -0.176774 0.188001 0.188043 0.146483 0.986699 -0.245010 -0.261533 -0.261533
charge: 0.459474 0.228300 0.151539 0.077366 0.077362 0.054367 -0.601355 0.198951 0.176993 0.177003
qa: 0.2118 0.2238 -0.1768 0.1880 0.1880 0.1465 0.9867 -0.2450 -0.2615 -0.2615
va: 3.7148 3.7715 3.9376 1.0128 1.0127 0.9985 3.3660 0.9717 0.9675 0.9675
dispcorr: -0.002226588 hartree
energy: -470.155513840182
