program: Orca
programVersion: 6.0.x
elementType: C N C H H C H H C C C C H C H C H H H F
charge: 1
multiplicity: 1
keywords: wB97X-D3 def2-TZVPPD autoaux TightSCF
formula: C9H9FN
InChI: InChI=1/C9H9FN/c10-6-7-11-8-9-4-2-1-3-5-9/h1-5H,6-7H2
20 atoms
C  -0.344492 -0.047751 0.241906
N  -0.512161 -0.081777 1.381566
C  -0.694287 -0.126156 2.800303
H  -1.133605 -1.096523 3.044536
H  -1.403411 0.661189 3.06743
C  0.644035 0.067728 3.526933
H  1.354812 -0.720684 3.264686
H  1.073517 1.05049 3.314387
C  -0.142693 -0.006936 -1.155259
C  -0.220133 1.230813 -1.821465
C  0.1298 -1.205227 -1.842383
C  -0.019953 1.25676 -3.192204
H  -0.432074 2.142653 -1.273905
C  0.325958 -1.150885 -3.212911
H  0.184215 -2.148712 -1.310361
C  0.251468 0.07287 -3.881481
H  -0.075402 2.198855 -3.72514
H  0.536606 -2.061713 -3.761321
H  0.407127 0.104884 -4.954652
F  0.360251 -0.014003 4.867918
totalener: -502.72890194121305 hartree
nucrepener: 523.21917908947364 hartree
electener: -1025.94809542124449 hartree
oneelecener: -1705.96965364730067 hartree
twoeener: 680.02155822605630 hartree
kineticenergy: 500.37440350973242 hartree
xcener: -47.843777901592 hartree
energy: -677.9079 -400.0380 -288.1068 -286.3059 -286.1181 -285.6351 -284.8720 -284.8713 -284.4346 -284.2236 -284.2226 -39.6486 -35.6242 -31.6433 -30.0925 -28.8420 -28.2594 -25.9512 -25.1762 -24.2327 -22.7921 -22.3191 -21.5622 -20.8313 -20.6147 -20.2165 -19.8212 -19.4369 -19.0333 -18.9175 -18.8350 -17.5175 -17.4360 -16.7774 -16.4651 -16.2110 -15.9639 -14.0289 -13.9123 -4.6193 -3.3098 -2.7483 -2.1007 -1.1654 -0.9790 -0.9555 -0.7948 -0.6177 -0.3039 -0.2071 electronvolt
chargesum: 1.0000000
charge: 0.706033 -0.005311 -0.105136 0.170282 0.168771 -0.011165 0.194126 0.194223 0.420802 -0.307536 -0.311531 -0.229450 0.109436 -0.227149 0.110333 -0.064028 0.156209 0.156021 0.168317 -0.293246
charge: 0.147746 0.253345 0.056970 0.058633 0.058469 -0.031763 0.041966 0.042204 -0.159553 0.086638 0.086772 0.061554 0.030684 0.061510 0.030649 0.079705 0.023737 0.023785 0.026506 0.020444
qa: 0.7060 -0.0053 -0.1051 0.1703 0.1688 -0.0112 0.1941 0.1942 0.4208 -0.3075 -0.3115 -0.2294 0.1094 -0.2271 0.1103 -0.0640 0.1562 0.1560 0.1683 -0.2932
va: 1.9144 3.6218 3.6361 1.0103 1.0113 3.6328 1.0422 1.0417 1.0640 3.1740 3.1787 3.5076 1.0049 3.5067 1.0037 3.3351 0.9410 0.9417 0.9178 0.8966
dispcorr: -0.005139813 hartree
energy: -502.734041754043
