program: Orca
programVersion: 6.0.x
elementType: C N C H H C H H O C H H H C H H F
charge: 1
multiplicity: 1
keywords: wB97X-D3 def2-TZVPPD autoaux TightSCF
formula: C5H9FNO
InChI: InChI=1/C5H9FNO/c1-8-5-4-7-3-2-6/h2-3,5H2,1H3
17 atoms
C  0.09761 0.710679 -0.56058
N  -0.076739 0.709535 0.570626
C  -0.293316 0.669398 1.987987
H  -1.367336 0.778412 2.156367
H  0.231323 1.524088 2.422138
C  0.305138 0.684397 -2.022966
H  -0.211166 1.566366 -2.437566
H  1.387088 0.806567 -2.197963
O  -0.205938 -0.527114 -2.458221
C  -0.073492 -0.706404 -3.874194
H  0.982917 -0.707779 -4.1642
H  -0.516754 -1.676289 -4.088989
H  -0.616324 0.077158 -4.414058
C  0.229196 -0.654349 2.571841
H  1.306265 -0.759071 2.415886
H  -0.302041 -1.511024 2.148814
F  -0.025101 -0.586049 3.917107
totalener: -425.49652333811355 hartree
nucrepener: 351.85556656570719 hartree
electener: -777.35208951032234 hartree
oneelecener: -1265.72472438443742 hartree
twoeener: 488.37263487411508 hartree
kineticenergy: 423.60438282756337 hartree
xcener: -38.878168048165 hartree
energy: -678.2134 -528.5831 -400.8985 -288.7564 -287.5513 -286.7538 -286.4777 -284.8969 -39.9728 -36.8097 -36.2641 -30.7012 -29.1463 -26.2642 -25.6834 -23.2633 -22.4397 -22.1624 -21.7075 -21.1820 -20.8234 -20.1185 -20.0524 -18.9693 -18.4189 -18.2915 -17.8349 -16.4932 -16.4072 -16.2814 -14.7335 -4.1767 -3.7897 -2.4136 -1.3646 -1.1497 -0.9237 -0.8282 -0.5042 -0.1522 0.0817 0.1604 electronvolt
chargesum: 1.0000000
charge: 0.152232 0.078437 -0.038080 0.176166 0.178444 0.070731 0.221215 0.219422 -0.330121 -0.353243 0.201644 0.151931 0.199290 -0.048628 0.211741 0.203198 -0.294378
charge: 0.221758 0.265823 0.071639 0.061188 0.061293 -0.034625 0.068969 0.068463 -0.090075 0.158168 0.018629 0.021676 0.018680 -0.026971 0.043861 0.044689 0.026834
qa: 0.1522 0.0784 -0.0381 0.1762 0.1784 0.0707 0.2212 0.2194 -0.3301 -0.3532 0.2016 0.1519 0.1993 -0.0486 0.2117 0.2032 -0.2944
va: 3.6098 3.6829 3.5904 1.0099 1.0068 3.7741 1.0182 1.0156 1.6763 3.8362 1.0049 1.0287 1.0063 3.6608 1.0204 1.0348 0.8968
dispcorr: -0.003549192 hartree
energy: -425.500072530374
