program: Gaussian 09
title: 000052822
version: EM64L-G09RevD.01
frameworkgroup: C1[X(C18H31ClNOSi)]
method: RPBEPBE
basis: SDD
operation: Freq
keyword: #p
keyword: freq=noraman
keyword: PBEPBE/SDD
title: #p freq=noraman PBEPBE/SDD
converged: NO YES NO NO
title: Mulliken charges:
elementType: Cl Si O N C C C C C C C C C C C C C C C C C C H H H H H H H H H H H H H H H H H H H H H H H H H H H H H H H
charge: -0.015812 1.387698 -0.558641 -0.100800 -0.810831 -0.832584 -0.384032 -0.374420 -0.357763 -0.354378 -0.211402 -0.288812 -0.292315 -0.294204 -0.572705 -0.307184 -0.333741 -0.703130 -0.696571 -0.214496 -0.223068 -0.129418 0.244677 0.250376 0.250204 0.236476 0.226972 0.213382 0.205295 0.226074 0.195995 0.214881 0.277808 0.281238 0.209075 0.231947 0.265811 0.255181 0.255479 0.250353 0.275707 0.260873 0.262834 0.255571 0.247041 0.267614 0.246585 0.248488 0.264937 0.242049 0.262811 0.271878 0.271002
chargesum: 1.00000
title: Mulliken charges with hydrogens summed into heavy atoms:
elementType: Cl Si O N C C C C C C C C C C C C C C C C C C
charge: -0.015812 1.387698 -0.558641 -0.100800 -0.315778 -0.345904 0.056322 0.056948 0.053112 0.204668 -0.211402 0.152209 0.228677 0.211627 0.226708 -0.051613 -0.086700 0.059558 0.073226 0.057382 0.047934 -0.129418
polarizability: 2.57345300e+02 -3.79759114e+01 2.34500886e+02 -6.64221343e+00 -8.49056788e+00 1.99604983e+02
1716.lowfreq: -5.0224 -3.7990 -0.0011 0.0005 0.0008 9.9498 20.2660 26.2419 34.4790
frequency: 19.9102 26.1969 34.3948 37.5687 47.4523 58.7616 69.0174 81.1708 87.9809 113.0248 122.6773 130.4769 160.4302 168.2437 189.4763 204.8656 218.0615 223.0922 240.6381 257.5414 264.7685 291.1122 303.0952 315.5745 323.2530 333.4338 340.4828 361.3986 369.8825 375.9484 396.5652 400.0623 449.6515 457.3705 461.0893 498.4565 515.8929 537.2535 603.9772 621.5178 667.2576 668.7825 706.5250 714.4754 727.3629 777.3067 780.0680 789.9020 794.2352 798.0806 801.0324 826.4418 842.4056 845.9783 871.1423 877.8798 916.0201 923.8867 947.2145 958.5999 974.6598 1000.0624 1012.5078 1016.6920 1024.7075 1032.1398 1039.0209 1049.5603 1056.4790 1067.4762 1068.8947 1074.7874 1095.3506 1100.9415 1104.6084 1121.0667 1131.2206 1137.7752 1167.3580 1172.2680 1188.6963 1195.2832 1204.8110 1211.3620 1245.0539 1255.3019 1275.8068 1284.1415 1294.5464 1296.9144 1297.0572 1320.1106 1333.6714 1335.1992 1338.9183 1344.9632 1345.3687 1360.7827 1369.0050 1379.4486 1387.8980 1412.6510 1416.3677 1421.8492 1425.4045 1434.6358 1458.5367 1462.4253 1465.1503 1465.1971 1465.9200 1472.9174 1475.9027 1476.3216 1476.9908 1484.0928 1486.4662 1488.7604 1493.2369 1497.4343 1562.0661 1576.8232 2947.3459 2970.6959 2971.6260 2975.6863 2980.0022 2985.3022 3007.0019 3007.9364 3009.5091 3024.7027 3027.1866 3029.3256 3031.7951 3037.2540 3038.8543 3044.4676 3051.5061 3054.4667 3085.3759 3095.0494 3097.1268 3099.2374 3116.2967 3117.4528 3122.9302 3126.6222 3128.3169 3143.2701 3155.0185 3165.6118 3169.9084
redmass: 4.6587 4.0915 4.4134 3.6221 3.7411 3.3757 4.1772 2.6871 2.7927 2.7853 1.8494 2.7885 2.3566 3.0058 4.0266 3.0439 1.6316 2.0385 1.8138 1.8224 2.0446 1.9441 2.0852 2.3065 3.8191 2.2582 3.5574 2.8798 2.9502 3.2446 4.7942 3.0503 2.9159 2.6303 2.4454 3.2332 2.7028 3.2178 6.2336 6.9813 3.2655 2.1271 3.1251 3.9752 6.9289 1.6119 2.7190 1.5005 2.6436 1.3801 1.1760 1.4282 1.6774 1.2488 1.3731 2.5502 2.2886 2.3639 2.4093 1.3114 1.3726 4.1328 1.5164 1.9918 2.0948 2.0152 4.7572 1.1192 2.9959 4.3704 2.0315 1.5936 2.1198 2.4580 1.6143 2.0428 1.0841 1.6171 1.9227 1.6687 1.3113 1.2287 1.7915 1.4877 1.2823 1.2204 1.3198 1.1119 1.1884 1.1148 1.2415 1.2253 1.5265 1.2350 2.7208 1.4110 1.4221 1.2857 1.3128 3.5432 1.2670 1.1910 1.1982 1.0887 1.0792 1.1547 1.0657 1.0563 2.0015 1.0890 1.1053 1.0725 1.0578 1.0722 1.0563 1.0465 1.0642 1.0621 1.0786 1.0555 7.0276 5.9345 1.0574 1.0645 1.0599 1.0622 1.0597 1.0617 1.0911 1.0496 1.0378 1.0603 1.0611 1.0986 1.0350 1.1017 1.0954 1.1020 1.0588 1.1007 1.1046 1.1008 1.0981 1.0991 1.0903 1.1024 1.1036 1.1064 1.0897 1.1042 1.1044 1.0949 1.0958
irintensity: 1.7724 2.0579 0.7805 0.1866 0.2341 0.3023 0.6066 1.2506 0.9357 0.2428 0.0545 1.6315 3.1173 4.1407 0.4504 0.1330 0.0324 0.9273 0.7017 2.5755 1.3250 3.5618 0.7941 0.9301 2.5891 2.4429 2.6982 1.9378 0.4415 6.5282 35.7213 5.5912 3.3524 5.1972 1.4242 38.6257 8.3811 21.2782 33.3402 1.1376 33.0631 13.4031 16.2430 6.8045 79.4808 47.5673 51.6309 76.3027 8.6060 9.3514 11.6786 37.6965 4.6511 0.5494 8.7795 13.8822 57.1266 0.2071 17.3644 0.9575 0.3903 42.2961 24.9730 29.8999 38.9073 7.4587 152.0553 2.1920 23.6736 85.4176 6.9566 6.6844 0.2193 10.3355 2.4104 2.3327 3.0286 1.6161 7.5377 3.9231 32.0890 4.0170 2.9450 14.0180 2.4950 0.5172 2.0680 2.6036 2.6060 12.5566 4.6823 4.2560 2.8646 0.9361 5.3129 2.8916 0.3375 0.4199 0.2906 7.7128 8.1927 27.2394 22.2491 10.4640 9.0156 29.7947 0.6153 3.1522 29.5080 5.9812 18.2287 15.4161 27.6050 27.0271 6.5985 11.6747 2.2763 60.4712 14.7081 12.1695 4.4493 62.9824 47.4420 29.8814 17.6434 26.8871 31.1191 9.8347 31.7973 5.6787 3.0718 7.0947 9.4691 29.5014 9.5141 15.6512 59.8925 39.2983 4.1080 37.3408 1.9486 4.1354 4.7743 2.8154 7.9598 18.1039 23.6797 2.0968 4.9147 7.3889 4.2105 1.9941 0.7012
temp: 298.150 k
press: 1.00000 atm
elementType: 17 14 8 7 6 6 6 6 6 6 6 6 6 6 6 6 6 6 6 6 6 6 1 1 1 1 1 1 1 1 1 1 1 1 1 1 1 1 1 1 1 1 1 1 1 1 1 1 1 1 1 1 1
symmnumber: 1
zpe: 1204605.5 jmol-1
zpe.correction: 0.458810 hartree
zpe.thermalcorrener: 0.484343 hartree
zpe.thermalcorrenthalpy: 0.485287 hartree
zpe.thermalcorrgfe: 0.401643 hartree
zpe.sumelectzpe: -1582.002432 hartree
zpe.sumelectthermal: -1581.976900 hartree
zpe.sumelectthermalent: -1581.975956 hartree
zpe.sumelectthermalfe: -1582.059599 hartree
dipole: -7.9528 -9.6450 -1.8154
dipole: 12.6321
quadrupole: -100.6856 -116.5572 -130.5005
quadrupole: 31.2762 0.3687 0.2576
quadrupole: 15.2288 -0.6427 -14.5861 31.2762 0.3687 0.2576
hfenergy: -1582.4612425 hartree
pointgroup: C01 [X(C18H31Cl1N1O1Si1)]
dipole: 4.8374998 -0.814137 -0.7969064 debye
polarizability: 207.7561609|8.4235287|282.2379409|9.1264781|-15.1962325|201.4570674 unknown
InChI: InChI=1S/C18H31ClNOSi/c1-4-20(3,5-2)13-14-21-22(15-7-6-8-16-22)18-11-9-17(19)10-12-18/h9-12H,4-8,13-16H2,1-3H3
charge 1 multiplicity 1
53 atoms
Cl -2.497481 -4.617094 1.133342
Si -1.059732 1.675254 -0.047225
O  0.729981 1.704435 -0.104478
N  3.494938 -0.894231 -0.270099
C  -1.475285 2.938808 1.300768
C  -1.747838 2.338604 -1.691544
C  -1.279696 4.389237 0.759756
C  -1.498492 3.875649 -1.786446
C  -2.033935 4.672849 -0.566848
C  2.419679 0.091879 0.238694
C  -1.523479 -0.143841 0.301266
C  1.518059 0.738679 -0.836092
C  4.213667 -1.544263 0.945558
C  2.865518 -2.023809 -1.138864
C  4.516506 -0.162284 -1.137899
C  -2.097208 -0.970114 -0.705284
C  -1.275328 -0.726446 1.577844
C  5.0091 -0.580479 1.832908
C  1.796035 -2.875543 -0.44673
C  -2.402019 -2.330102 -0.462195
C  -1.574091 -2.082082 1.843463
C  -2.1262 -2.868062 0.810355
H  -0.85636 2.775741 2.203043
H  -2.531363 2.79474 1.605816
H  -2.839027 2.140208 -1.724522
H  -1.306263 1.822915 -2.567226
H  -1.620597 5.105596 1.531364
H  -0.198853 4.581275 0.605535
H  -0.4106 4.06757 -1.886184
H  -1.972696 4.260006 -2.709601
H  -3.11521 4.461005 -0.43209
H  -1.954243 5.753457 -0.791568
H  2.944825 0.901805 0.769426
H  1.790742 -0.450955 0.962132
H  0.885707 -0.024418 -1.337538
H  2.114783 1.267254 -1.605549
H  3.425454 -2.042304 1.532005
H  4.873949 -2.321213 0.520215
H  2.448652 -1.524006 -2.029364
H  3.714959 -2.648377 -1.469714
H  4.859137 0.744537 -0.620286
H  4.049924 0.116472 -2.093672
H  5.369753 -0.831888 -1.327988
H  -2.32929 -0.555256 -1.6938
H  -0.864524 -0.115317 2.391933
H  5.454968 -1.173945 2.650562
H  5.842266 -0.090131 1.303665
H  4.377594 0.189342 2.305544
H  1.410469 -3.594356 -1.191424
H  2.192035 -3.470974 0.39193
H  0.932052 -2.287604 -0.094779
H  -2.852951 -2.952929 -1.240426
H  -1.39919 -2.514097 2.833409
