program: Orca
programVersion: 6.0.x
elementType: C N C H H C H H C H H H C H H F
charge: 1
multiplicity: 1
keywords: wB97X-D3 def2-TZVPPD autoaux TightSCF
formula: C5H9FN
InChI: InChI=1/C5H9FN/c1-2-4-7-5-3-6/h2-3,5H2,1H3
16 atoms
C  0.240843 0.20017 -1.153175
N  0.26692 -0.165385 -0.065867
C  0.313432 -0.609501 1.297661
H  -0.255212 -1.540478 1.358487
H  1.36046 -0.808488 1.538713
C  0.209151 0.630309 -2.542293
H  -0.347046 1.5742 -2.568862
H  1.246116 0.849769 -2.821776
C  -0.419005 -0.429433 -3.469248
H  -1.460278 -0.621196 -3.206247
H  -0.388072 -0.038445 -4.487009
H  0.141801 -1.364863 -3.442693
C  -0.272134 0.455181 2.238442
H  0.298353 1.386764 2.188801
H  -1.327072 0.64234 2.020212
F  -0.163652 -0.069546 3.50077
totalener: -350.29826729375429 hartree
nucrepener: 280.19816105699607 hartree
electener: -630.49642105206522 hartree
oneelecener: -1020.47999133545852 hartree
twoeener: 389.98357028339331 hartree
kineticenergy: 348.65916054352653 hartree
xcener: -32.793193948097 hartree
energy: -678.1863 -400.6372 -288.6325 -286.6746 -286.4431 -286.2415 -284.4310 -39.9423 -36.1832 -30.9304 -29.9067 -26.4042 -25.9572 -23.1516 -22.1038 -21.7982 -21.4332 -20.7268 -20.1550 -19.9799 -19.1561 -18.4191 -17.7512 -17.6417 -17.2551 -16.4076 -16.2516 -3.7711 -3.6829 -2.4614 -1.3909 -1.1950 -0.9381 -0.7440 -0.3358 -0.0854 0.0745 0.2651 electronvolt
chargesum: 1.0000000
charge: 0.093655 0.053707 -0.043673 0.179242 0.178828 0.218873 0.177430 0.177805 -0.747710 0.230900 0.183721 0.234049 -0.058252 0.204999 0.209328 -0.292901
charge: 0.150268 0.255929 0.065248 0.059550 0.059691 0.026756 0.049913 0.050416 0.183539 0.005262 0.006784 0.005390 -0.030411 0.043158 0.043139 0.025367
qa: 0.0937 0.0537 -0.0437 0.1792 0.1788 0.2189 0.1774 0.1778 -0.7477 0.2309 0.1837 0.2340 -0.0583 0.2050 0.2093 -0.2929
va: 3.7138 3.6374 3.5943 1.0102 1.0108 3.4698 1.0179 1.0232 3.8235 1.0478 1.0983 1.0424 3.6628 1.0280 1.0257 0.8988
dispcorr: -0.003272571 hartree
energy: -350.301539865203
