program: Orca
programVersion: 6.0.x
elementType: C N C H H C H H C C C C H C H C H H F O C H H H
charge: 1
multiplicity: 1
keywords: wB97X-D3 def2-TZVPPD autoaux TightSCF
formula: C10H11FNO
InChI: InChI=1/C10H11FNO/c1-13-10-4-2-9(3-5-10)8-12-7-6-11/h2-5H,6-7H2,1H3
24 atoms
C  -0.362284 -0.16865 1.24756
N  -0.489973 -0.184817 2.395892
C  -0.622744 -0.206775 3.818882
H  -0.816663 -1.241585 4.112471
H  -1.489261 0.403087 4.086496
C  0.650022 0.318463 4.494845
H  1.518081 -0.293561 4.234515
H  0.834334 1.365043 4.237333
C  -0.210565 -0.163067 -0.143765
C  -0.311464 1.049753 -0.855085
C  0.042631 -1.379052 -0.825876
C  -0.162283 1.05615 -2.226322
H  -0.505545 1.979283 -0.330667
C  0.189256 -1.367028 -2.189097
H  0.119302 -2.311872 -0.278004
C  0.089128 -0.153281 -2.905818
H  -0.241411 1.992593 -2.763177
H  0.382719 -2.279101 -2.741191
F  0.428921 0.227513 5.848365
O  0.246231 -0.254504 -4.215224
C  0.164887 0.90879 -5.043194
H  0.946721 1.625394 -4.776173
H  0.324726 0.550405 -6.057416
H  -0.82473 1.367755 -4.96448
totalener: -617.27873777532670 hartree
nucrepener: 703.56704324379621 hartree
electener: -1320.84578301216334 hartree
oneelecener: -2219.95795257267355 hartree
twoeener: 899.11216956051021 hartree
kineticenergy: 614.43092239421765 hartree
xcener: -58.123301023830 hartree
energy: -677.6936 -528.3016 -399.5368 -287.6771 -286.0665 -286.0100 -285.8717 -285.1277 -284.7862 -284.6488 -284.4514 -284.0002 -283.8765 -39.4236 -36.5118 -35.1721 -31.3282 -29.7637 -28.5539 -28.1736 -26.4807 -25.5838 -24.4412 -23.9109 -22.5386 -22.1055 -21.2971 -21.0781 -20.5798 -20.4469 -19.5786 -19.4415 -19.3608 -19.1768 -18.7254 -18.5794 -17.9539 -17.7664 -17.2723 -17.1111 -16.5188 -16.1390 -15.7431 -15.4966 -15.4112 -13.8526 -12.7090 -4.1180 -2.9757 -2.5461 -1.9060 -1.0291 -0.8507 -0.7447 -0.6055 -0.5042 -0.3987 -0.1882 electronvolt
chargesum: 1.0000000
charge: 0.803155 -0.038424 -0.132153 0.168735 0.170863 -0.003701 0.191989 0.189814 0.039978 -0.675239 -0.412240 0.143208 0.083942 -0.292722 0.094131 1.046491 0.105216 0.134116 -0.297494 -0.445155 -0.475326 0.230762 0.139768 0.230288
charge: 0.129348 0.243949 0.049179 0.057698 0.056360 -0.033535 0.041386 0.040970 -0.168403 0.091728 0.089404 0.105234 0.033776 0.119089 0.032958 -0.208625 0.016147 0.036682 0.016558 0.014656 0.171728 0.020672 0.022386 0.020653
qa: 0.8032 -0.0384 -0.1322 0.1687 0.1709 -0.0037 0.1920 0.1898 0.0400 -0.6752 -0.4122 0.1432 0.0839 -0.2927 0.0941 1.0465 0.1052 0.1341 -0.2975 -0.4452 -0.4753 0.2308 0.1398 0.2303
va: 1.7050 3.5765 3.6386 1.0119 1.0119 3.6311 1.0410 1.0406 0.8743 2.9531 2.8723 3.0883 1.0151 3.5775 1.0077 2.4564 0.9250 0.9906 0.8916 1.6665 3.8202 0.9465 1.0556 0.9460
dispcorr: -0.006885011 hartree
energy: -617.285622785918
