program: Orca
programVersion: 6.0.x
elementType: C N C H H H C H C H H
charge: 1
multiplicity: 1
keywords: wB97X-D3 def2-TZVPPD autoaux TightSCF
formula: C4H6N
InChI: InChI=1/C4H6N/c1-3-4-5-2/h2-3H,1,4H2
11 atoms
C  0.422867 -2.200273 0.329906
N  0.050788 -1.238112 -0.155529
C  -0.414134 0.019104 -0.725305
H  -1.408645 -0.199332 -1.126197
H  0.268406 0.235793 -1.551299
H  0.776833 -3.111358 0.78642
C  -0.42129 1.096982 0.325209
H  -1.167209 1.002843 1.109321
C  0.402368 2.139693 0.265755
H  1.139993 2.254778 -0.524274
H  0.350603 2.927663 1.009091
totalener: -210.45776028533743 hartree
nucrepener: 150.43534845664811 hartree
electener: -360.89310914480700 hartree
oneelecener: -572.09278509667240 hartree
twoeener: 211.19967595186543 hartree
kineticenergy: 209.38833115337414 hartree
xcener: -20.881473519969 hartree
energy: -401.5387 -289.0983 -287.0982 -284.6362 -284.2598 -36.7689 -30.9935 -28.2212 -25.6439 -23.7579 -22.8839 -21.9941 -20.9757 -19.7092 -18.9115 -18.0338 -16.9162 -14.6590 -4.5933 -4.5059 -2.5151 -2.2874 -1.7573 -1.0552 -0.9589 -0.7629 0.1032 0.2609 0.6061 electronvolt
chargesum: 1.0000000
charge: 0.180116 0.223465 0.060935 0.151656 0.175864 0.151197 -0.156222 0.187056 -0.259331 0.123298 0.161967
charge: 0.421917 0.208250 0.027695 0.055643 0.054450 0.042397 -0.030529 0.011690 0.229946 -0.010656 -0.010803
qa: 0.1801 0.2235 0.0609 0.1517 0.1759 0.1512 -0.1562 0.1871 -0.2593 0.1233 0.1620
va: 3.6883 3.7380 3.3800 1.0287 0.9475 1.0034 3.4282 0.9428 3.7646 0.9896 0.9882
dispcorr: -0.001844675 hartree
energy: -210.459604960712
