program: Orca
programVersion: 6.0.x
elementType: C N C H H C H H H C C C C H C H H H N
charge: 1
multiplicity: 1
keywords: wB97X-D3 def2-TZVPPD autoaux TightSCF
formula: C8H9N2
InChI: InChI=1/C8H9N2/c1-2-9-7-8-3-5-10-6-4-8/h3-6H,2H2,1H3
19 atoms
C  -0.256977 0.102665 0.802324
N  -0.378449 0.162914 1.943383
C  -0.493918 0.232648 3.380191
H  -1.390849 -0.335403 3.639565
H  -0.670058 1.286141 3.611492
C  0.756822 -0.309582 4.063354
H  0.615368 -0.216284 5.141897
H  0.913394 -1.363842 3.828048
H  1.642744 0.263056 3.782533
C  -0.111311 0.03613 -0.613083
C  0.086171 1.215136 -1.342082
C  -0.166763 -1.204341 -1.259375
C  0.221906 1.085163 -2.721437
H  0.133153 2.186408 -0.863696
C  -0.016259 -1.198452 -2.643613
H  -0.318846 -2.130584 -0.717662
H  0.377164 1.963849 -3.339536
H  -0.04941 -2.130055 -3.199752
N  0.172824 -0.086938 -3.356489
totalener: -419.50915234606788 hartree
nucrepener: 452.80008075751834 hartree
electener: -872.30923248688771 hartree
oneelecener: -1449.86234376320454 hartree
twoeener: 577.55311127631683 hartree
kineticenergy: 417.42033737987424 hartree
xcener: -41.432878103083 hartree
energy: -400.2489 -396.8109 -288.2425 -286.3878 -286.0825 -285.0164 -285.0157 -284.9508 -284.9496 -283.9781 -35.7683 -33.3600 -30.8852 -29.8692 -28.5354 -26.4737 -25.8055 -24.8597 -22.8649 -22.2658 -21.4444 -20.7083 -20.3799 -20.3155 -19.1203 -18.9558 -18.6414 -18.3346 -17.5740 -17.4200 -17.1062 -16.6885 -14.9776 -14.0315 -13.7971 -4.9431 -3.4382 -2.8635 -2.1758 -1.3874 -1.0482 -1.0187 -0.7654 -0.4229 -0.3213 -0.0749 electronvolt
chargesum: 1.0000000
charge: 0.723169 0.037450 0.015595 0.185293 0.182544 -0.654929 0.194099 0.212245 0.211575 0.240774 -0.170456 -0.189682 0.011568 0.120988 0.019829 0.120802 0.145124 0.147036 -0.553027
charge: 0.158166 0.256543 0.004758 0.049613 0.050009 0.178945 0.005738 0.002061 0.002571 -0.152266 0.104359 0.104283 -0.007884 0.028785 -0.007879 0.028708 0.029537 0.029500 0.134451
qa: 0.7232 0.0375 0.0156 0.1853 0.1825 -0.6549 0.1941 0.2122 0.2116 0.2408 -0.1705 -0.1897 0.0116 0.1210 0.0198 0.1208 0.1451 0.1470 -0.5530
va: 1.8867 3.6038 3.3602 0.9886 0.9893 3.8214 1.0797 1.0566 1.0601 1.4591 3.1418 3.1486 3.5006 1.0097 3.4942 1.0121 0.9521 0.9502 2.2106
dispcorr: -0.004480652 hartree
energy: -419.513632998247
