program: Orca
programVersion: 6.0.x
elementType: C N C H H C H H C C H H H C H H H
charge: 1
multiplicity: 1
keywords: wB97X-D3 def2-TZVPPD autoaux TightSCF
formula: C6H10N
InChI: InChI=1/C6H10N/c1-3-5-6-7-4-2/h3H,1,4-5H2,2H3
17 atoms
C  -0.26518 -0.342635 -0.071529
N  -0.247862 0.130071 0.973051
C  -0.223598 0.701145 2.299726
H  0.336124 1.635596 2.213996
H  -1.262844 0.935869 2.542247
C  -0.261496 -0.902087 -1.419915
H  0.147956 -1.917081 -1.343286
H  -1.307441 -0.984715 -1.736241
C  0.549694 -0.028517 -2.361096
C  -0.005783 0.646544 -3.361916
H  1.622416 -0.010352 -2.191292
H  0.606783 1.235565 -4.0356
H  -1.075198 0.627796 -3.554486
C  0.401782 -0.262454 3.30195
H  0.383053 0.216352 4.282821
H  -0.163819 -1.193963 3.364439
H  1.440688 -0.481204 3.048197
totalener: -289.13305081853866 hartree
nucrepener: 265.47442339176143 hartree
electener: -554.60747715404455 hartree
oneelecener: -903.67732072252272 hartree
twoeener: 349.06984356847818 hartree
kineticenergy: 287.59489000301335 hartree
xcener: -29.243732951735 hartree
energy: -400.2192 -288.2299 -286.3691 -286.0353 -284.3984 -283.9739 -283.8510 -35.7606 -30.7091 -29.7632 -27.5255 -26.0987 -23.0668 -22.5029 -21.6518 -21.2019 -21.0165 -19.7351 -19.5835 -18.2114 -18.1483 -17.5523 -17.0638 -16.8548 -16.4309 -14.2277 -3.5116 -3.3087 -2.1807 -1.7590 -1.2441 -0.9888 -0.8813 -0.4114 -0.1628 0.0741 0.2722 electronvolt
chargesum: 1.0000000
charge: 0.153322 0.072221 0.067298 0.191343 0.187938 0.139262 0.157078 0.156758 -0.242693 -0.297988 0.186871 0.163507 0.124824 -0.683633 0.192201 0.214614 0.217077
charge: 0.151028 0.250224 0.005271 0.049452 0.049203 0.036906 0.051232 0.050112 -0.037506 0.219712 0.012417 -0.013836 -0.012662 0.178119 0.005735 0.002334 0.002260
qa: 0.1533 0.0722 0.0673 0.1913 0.1879 0.1393 0.1571 0.1568 -0.2427 -0.2980 0.1869 0.1635 0.1248 -0.6836 0.1922 0.2146 0.2171
va: 3.5752 3.6138 3.3255 0.9880 0.9927 3.6753 1.0437 1.0102 3.5398 3.7883 0.9593 0.9863 0.9958 3.8471 1.0864 1.0551 1.0532
dispcorr: -0.003396939 hartree
energy: -289.136447757889
