program: Orca
programVersion: 6.0.x
elementType: C N C H H H C C C C H C H C H H H
charge: 1
multiplicity: 1
keywords: wB97X-D3 def2-TZVPPD autoaux TightSCF
formula: C8H8N
InChI: InChI=1/C8H8N/c1-9-7-8-5-3-2-4-6-8/h2-6H,1H3
17 atoms
C  -0.00077 -0.000902 1.34073
N  -0.000235 -0.000618 2.491896
C  0.002812 -0.00261 3.919973
H  0.230931 -1.010028 4.270383
H  -0.985639 0.305247 4.263892
H  0.757537 0.705343 4.264879
C  -0.000786 -0.000704 -0.073209
C  1.229461 -0.000343 -0.756508
C  -1.230555 -0.000674 -0.757329
C  1.215779 0.000378 -2.142255
H  2.166296 -0.000607 -0.21014
C  -1.2159 0.000032 -2.14306
H  -2.167785 -0.001204 -0.211657
C  0.000178 0.000612 -2.829254
H  2.152041 0.00072 -2.688311
H  -2.151785 0.000093 -2.689762
H  0.000553 0.001213 -3.914169
totalener: -364.16340570724242 hartree
nucrepener: 377.18825432456811 hartree
electener: -741.35168246964008 hartree
oneelecener: -1225.77980499482851 hartree
twoeener: 484.42812252518843 hartree
kineticenergy: 362.31782260300946 hartree
xcener: -36.387271219457 hartree
energy: -399.9593 -287.9757 -286.1236 -285.5431 -284.7747 -284.7744 -284.3404 -284.1384 -284.1379 -35.5020 -31.5387 -29.6592 -28.6176 -28.1680 -25.1842 -24.1439 -22.7105 -22.1652 -20.9497 -20.9408 -20.5191 -19.7602 -18.9461 -18.7508 -18.4947 -17.5565 -17.0612 -16.6914 -16.3759 -13.9511 -13.8225 -4.4829 -3.2003 -2.6630 -2.1029 -1.1343 -1.0116 -0.7896 -0.5743 -0.2231 -0.0112 0.0159 electronvolt
chargesum: 1.0000000
charge: 0.598555 0.055489 -0.231954 0.193681 0.184075 0.190412 0.403149 -0.301779 -0.293313 -0.204878 0.109687 -0.206389 0.109462 -0.088373 0.157977 0.157862 0.166336
charge: 0.138645 0.214970 0.218209 0.027799 0.029399 0.028647 -0.160422 0.085350 0.085350 0.060434 0.030344 0.060446 0.030315 0.077759 0.023359 0.023359 0.026038
qa: 0.5986 0.0555 -0.2320 0.1937 0.1841 0.1904 0.4031 -0.3018 -0.2933 -0.2049 0.1097 -0.2064 0.1095 -0.0884 0.1580 0.1579 0.1663
va: 2.2537 3.5733 3.6106 0.9787 0.9819 0.9786 1.3355 3.1969 3.2024 3.4996 1.0030 3.5001 1.0036 3.3566 0.9373 0.9378 0.9205
dispcorr: -0.003801594 hartree
energy: -364.167207301466
