program: Orca
programVersion: 6.0.x
elementType: C N C H H H C H H C H H H
charge: 1
multiplicity: 1
keywords: wB97X-D3 def2-TZVPPD autoaux TightSCF
formula: C4H8N
InChI: InChI=1/C4H8N/c1-3-4-5-2/h3H2,1-2H3
13 atoms
C  0.339551 0.013852 0.041924
N  0.07654 0.006384 1.157812
C  -0.239715 0.000756 2.55363
H  -1.323058 0.066736 2.660359
H  0.243561 0.861544 3.017203
H  0.133404 -0.928157 2.986232
C  0.643426 0.027077 -1.380944
H  1.219782 0.940089 -1.568705
H  1.303951 -0.826356 -1.571008
C  -0.629794 -0.030811 -2.248135
H  -1.279729 0.82448 -2.057535
H  -0.322419 -0.002575 -3.2943
H  -1.183782 -0.954982 -2.077305
totalener: -211.73329421790942 hartree
nucrepener: 161.61700777092096 hartree
electener: -373.35030080603286 hartree
oneelecener: -595.27252680207800 hartree
twoeener: 221.92222599604514 hartree
kineticenergy: 210.60417099858975 hartree
xcener: -21.337173469968 hartree
energy: -400.5539 -288.4971 -286.5017 -286.1461 -284.3574 -36.0606 -30.6960 -29.5107 -26.0798 -23.0622 -21.8549 -21.6848 -21.2316 -20.4042 -19.0971 -18.1126 -17.6776 -17.4195 -17.1166 -3.6259 -3.5498 -2.4482 -1.4690 -0.9670 -0.5656 -0.4073 0.0428 0.2733 0.3760 0.5586 electronvolt
chargesum: 1.0000000
charge: 0.040276 0.116220 -0.181602 0.191049 0.189505 0.187448 0.201060 0.174637 0.175127 -0.732544 0.230288 0.179377 0.229158
charge: 0.139886 0.217351 0.228047 0.030720 0.030829 0.030720 0.025337 0.049481 0.049462 0.181954 0.004867 0.006410 0.004935
qa: 0.0403 0.1162 -0.1816 0.1910 0.1895 0.1874 0.2011 0.1746 0.1751 -0.7325 0.2303 0.1794 0.2292
va: 3.7721 3.6169 3.5931 0.9821 0.9857 0.9884 3.5537 1.0270 1.0270 3.8238 1.0465 1.1026 1.0481
dispcorr: -0.001990670 hartree
energy: -211.735284888403
