program: Gaussian 09
title: 000052694
version: EM64L-G09RevD.01
frameworkgroup: C1[X(C8H9BrO)]
method: RPBEPBE
basis: SDD
operation: Freq
keyword: #p
keyword: freq=noraman
keyword: PBEPBE/SDD
title: #p freq=noraman PBEPBE/SDD
converged: YES YES NO NO
title: Mulliken charges:
elementType: Br O C C C C C C C C H H H H H H H H H
charge: -0.037878 -0.454007 -0.169933 0.432611 -0.705731 -0.371567 -0.410687 -0.217323 -0.222030 -0.235991 0.237330 0.296973 0.305493 0.278723 0.232322 0.228441 0.228438 0.230392 0.354424
chargesum: 0.00000
title: Mulliken charges with hydrogens summed into heavy atoms:
elementType: Br O C C C C C C C C
charge: -0.037878 -0.099584 0.067397 0.432611 -0.103265 -0.092844 -0.178365 0.011118 0.006408 -0.005599
polarizability: 1.63183862e+02 4.08915249e+00 9.11971395e+01 1.23850574e+01 -8.87333581e+00 5.82463709e+01
1716.lowfreq: -3.5915 -0.0008 -0.0008 -0.0006 7.9258 10.6932 36.4920 80.5667 87.2794
frequency: 36.4798 80.5510 87.2256 172.1180 231.7738 239.7851 357.4029 399.3045 403.8878 466.2326 504.7126 552.5488 615.5877 636.9091 705.4657 763.4377 799.3940 845.5335 858.3819 928.1562 968.5665 983.0296 989.6382 1001.1642 1025.5698 1046.0425 1081.7276 1136.2714 1164.6666 1173.7537 1186.5890 1210.5589 1229.0899 1309.0857 1319.9783 1370.5199 1388.7172 1423.2626 1439.3898 1481.8411 1594.7369 1612.9431 2966.3624 3061.2965 3113.7589 3129.2223 3143.3351 3155.9101 3160.3144 3174.1135 3523.0554
redmass: 4.7509 5.6287 3.4193 9.4429 4.2245 4.5275 3.0151 1.4506 2.0498 3.8008 3.0812 4.8523 6.4234 4.7200 1.8044 1.9118 2.8535 2.2959 1.2466 1.4177 1.9642 1.3878 5.9262 1.3349 2.1777 4.4485 1.6355 1.2706 1.6507 1.0748 1.1732 1.1944 1.2684 1.2424 1.3011 1.7163 4.8595 1.1236 2.1619 2.3449 6.2107 6.1100 1.0844 1.0561 1.0880 1.0868 1.0927 1.1116 1.0979 1.0973 1.0654
irintensity: 0.6609 0.4594 1.6261 3.6941 5.0791 6.1624 19.0070 107.5451 43.1313 11.1634 10.1967 72.5141 0.3630 29.4545 61.5065 47.6701 3.9291 12.0051 0.2824 3.0962 40.9772 0.8349 0.4582 1.6915 9.2876 30.5524 5.5070 20.4645 42.4142 3.1082 6.2803 15.1791 28.5756 13.6241 9.0365 6.1585 0.6639 14.3558 12.9313 13.2124 0.5229 0.8928 32.4183 8.1341 8.8560 1.2518 27.8497 2.4606 26.6057 9.6259 9.4307
temp: 298.150 k
press: 1.00000 atm
elementType: 35 8 6 6 6 6 6 6 6 6 1 1 1 1 1 1 1 1 1
symmnumber: 1
zpe: 390278.1 jmol-1
zpe.correction: 0.148649 hartree
zpe.thermalcorrener: 0.158290 hartree
zpe.thermalcorrenthalpy: 0.159234 hartree
zpe.thermalcorrgfe: 0.111640 hartree
zpe.sumelectzpe: -398.187274 hartree
zpe.sumelectthermal: -398.177633 hartree
zpe.sumelectthermalent: -398.176689 hartree
zpe.sumelectthermalfe: -398.224284 hartree
dipole: -1.3254 -1.2324 -0.4995
dipole: 1.8775
quadrupole: -66.4621 -66.4237 -70.4738
quadrupole: 3.5562 3.9782 -3.4621
quadrupole: 1.3244 1.3629 -2.6873 3.5562 3.9782 -3.4621
hfenergy: -398.3359233 hartree
pointgroup: C01 [X(C8H9Br1O1)]
dipole: -0.5690677 -0.4200318 -0.2129479 debye
dipolederiv: -0.8558422 0.078828 0.0825917 0.0703564 -0.1704601 -0.0372962 -0.0082315 -0.0269941 -0.1860423 -0.3996702 -0.1692389 0.0090452 -0.2035257 -0.6415844 -0.1283212 -0.0078358 -0.1299849 -0.6248973 0.1827248 0.1601362 0.0611131 0.1520064 0.5271968 0.0770613 -0.1315903 0.1096254 0.4470287 0.108847 -0.0087962 0.0049488 0.0712701 -0.0582222 -0.0411572 0.1965725 -0.0408107 -0.0881338 1.1184841 -0.0860616 0.0171589 -0.1712738 0.0208114 -0.0359746 -0.0070074 -0.06968 -0.0084839 -0.1168186 0.0798361 0.0076336 0.0042787 0.0183598 -0.0145025 0.0969537 0.0043824 -0.1232825 -0.0639675 -0.0587238 0.0470506 0.043373 0.0127292 -0.068459 0.0459732 -0.072749 -0.1344377 -0.0246131 -0.0885175 0.0588494 -0.1019599 0.0800685 -0.0688632 0.0132727 -0.0702272 -0.1176149 -0.0381586 0.0865295 0.0064854 0.1123903 0.0652073 -0.0439748 -0.0321294 -0.0386855 -0.1274904 0.0760018 0.0158774 0.0557086 -0.0024148 -0.0679624 -0.0250313 0.0546381 -0.0220974 -0.1441833 -0.0006292 -0.001229 -0.0538992 0.0074745 -0.100822 0.0837202 -0.0164068 0.0767669 -0.068714 -0.0570753 -0.0595733 -0.027724 -0.0213395 -0.035249 -0.0529719 -0.0323165 -0.0279679 0.0793106 -0.0551779 0.054465 -0.0605665 0.0046631 0.0506923 0.0873901 0.0002931 0.0349112 0.0052735 0.1099365 -0.0633246 0.0023661 -0.0629875 0.0121585 0.0293471 0.0235225 0.0209623 0.1453562 0.0405903 0.09448 -0.0570434 0.0793504 -0.0293207 0.064066 -0.0468004 0.0679093 0.1127385 0.0197346 0.0758021 -0.0431457 0.0905943 -0.0526793 0.0698177 -0.0584001 0.0674252 0.1287983 0.0149146 -0.0906763 0.000317 -0.1109657 -0.0591617 0.0412595 -0.0033871 0.0421699 0.146592 -0.1298186 -0.0085873 -0.0545587 -0.0086077 0.0939433 0.0162304 -0.0516156 0.0151509 0.1455382 0.0705375 -0.0112257 -0.056331 0.0473175 0.3342947 0.0476597 -0.0355051 0.0598932 0.4126439 unknown
polarizability: 164.1316826|-3.2318585|92.5574473|6.8854253|-6.5322044|55.9382426 unknown
InChI: InChI=1S/C8H9BrO/c9-6-8(10)7-4-2-1-3-5-7/h1-5,8,10H,6H2
charge 0 multiplicity 1
19 atoms
Br 4.091024 -0.601447 -0.452057
O  1.759784 1.383432 0.81221
C  1.356319 0.010679 0.512293
C  -0.148379 -0.002208 0.253166
C  2.067396 -0.516942 -0.749481
C  -0.813775 1.162416 -0.200532
C  -0.880076 -1.204081 0.422954
C  -2.198394 1.122545 -0.479066
C  -2.263422 -1.243595 0.14005
C  -2.926006 -0.079196 -0.31428
H  1.598044 -0.661153 1.36317
H  1.777488 -1.547453 -1.001583
H  1.934972 0.161146 -1.60607
H  -0.24294 2.090129 -0.300312
H  -0.373915 -2.106194 0.790566
H  -2.710493 2.029302 -0.820102
H  -2.823304 -2.174868 0.280286
H  -4.000008 -0.106941 -0.529861
H  2.750084 1.408829 0.884048
