program: Gaussian 09
title: ts
version: EM64L-G09RevD.01
method: RwB97XD
basis: 6-31+G(d,p)
operation: Freq
keyword: #P
keyword: Geom=AllCheck
keyword: Guess=TCheck
keyword: SCRF=Check
keyword: GenChk
keyword: RwB97XD/6-31+G(d,p)
keyword: Freq
converged: YES YES YES YES
title: Mulliken charges:
elementType: C N C H H O H H O H H C C C C H C H C H H H O C H H H
charge: -1.056182 0.060451 -0.243462 0.234642 0.214717 -0.692251 0.482017 0.411400 -0.778608 0.402499 0.402293 1.633889 0.190214 -0.725853 -0.030477 0.209212 -0.432711 0.193710 -0.140426 0.192194 0.192520 0.193716 -0.216051 -0.256807 0.175501 0.203061 0.180793
chargesum: 1.00000
title: Mulliken charges with hydrogens summed into heavy atoms:
elementType: C N C O O C C C C C C O C
charge: -1.056182 0.060451 0.205897 0.201167 0.026183 1.633889 0.399426 -0.532143 0.161717 -0.240191 0.053289 -0.216051 0.302548
polarizability: 1.50474935e+02 2.07774157e+01 9.29498219e+01 -3.37981758e+00 7.74703064e-02 1.61854158e+02
1716.lowfreq: -250.6120 -11.5818 -0.0004 -0.0003 0.0003 5.1068 11.2050 19.1149 29.1743
frequency: -250.6101 17.3484 28.9952 48.4758 73.3694 89.7950 103.9800 134.9608 144.8566 178.2067 193.3057 221.9511 255.8035 264.9469 303.6918 309.6497 322.9594 408.1093 413.0383 461.3847 463.5200 496.4313 547.5764 604.0068 632.5813 639.0072 668.9902 700.9972 781.0427 792.8141 882.7242 895.8530 950.4180 987.3569 1012.9198 1023.5971 1028.9004 1050.8116 1063.7481 1129.8367 1171.9437 1193.5154 1197.7643 1202.8737 1229.9180 1284.4818 1308.4212 1345.0432 1352.0809 1376.1937 1486.0789 1496.5499 1505.7933 1512.9241 1529.3318 1538.6165 1645.3803 1652.2829 1670.0691 1673.5293 1947.6057 3060.9393 3103.5968 3148.4594 3185.5694 3223.8298 3233.3881 3241.9508 3250.2980 3255.5985 3273.0891 3444.4902 3887.1250 3919.6098 3998.1050
redmass: 7.1154 4.6209 4.9610 3.9067 3.4899 4.1150 1.0353 4.3084 2.0724 3.1528 1.9785 3.5324 4.6420 3.8675 1.0813 5.9956 1.2981 3.4250 3.1321 2.7756 3.2288 1.5396 2.2378 5.2927 2.9345 2.1496 4.0829 2.2653 5.9503 1.5401 1.2315 1.0747 2.8599 1.3392 1.7398 5.4546 1.3707 1.3321 2.3119 1.5500 1.8398 1.2839 1.6926 1.1635 1.1957 2.9479 1.4826 1.2915 2.3214 1.8827 1.0943 2.3093 1.0575 1.0480 1.2002 2.1130 1.0843 5.5402 4.3245 1.1310 11.2841 1.0335 1.0565 1.1080 1.1150 1.1034 1.0882 1.0910 1.0945 1.0983 1.0950 1.0631 1.0446 1.0688 1.0836
irintensity: 406.5528 2.4288 1.0644 0.6442 1.3370 1.5077 23.2705 2.4310 3.3756 0.6109 0.6599 2.5672 0.7706 0.6307 49.2025 30.3821 245.0434 2.7230 6.3287 18.8503 6.7588 109.6707 74.1161 48.7064 4.9340 133.2091 9.9887 32.1591 32.6103 65.2824 8.1072 104.5610 35.5672 2.8764 12.8385 7.3278 1.1676 0.2532 3.7994 16.1079 66.6421 5.3339 28.3579 8.7535 13.6690 261.0525 40.2687 9.2463 5.6849 4.1274 11.0449 11.3242 10.8799 13.7425 21.6649 4.9627 137.1306 3.2974 53.7641 24.1647 281.7301 16.7543 4.4370 18.8791 8.8021 2.2430 0.2234 1.8500 0.2070 1.5893 9.0296 1310.8563 44.7624 171.2637 130.3306
temp: 298.150 k
press: 1.00000 atm
elementType: 6 7 6 1 1 8 1 1 8 1 1 6 6 6 6 1 6 1 6 1 1 1 8 6 1 1 1
symmnumber: 1
zpe: 585419.0 jmol-1
zpe.correction: 0.222974 hartree
zpe.thermalcorrener: 0.238792 hartree
zpe.thermalcorrenthalpy: 0.239736 hartree
zpe.thermalcorrgfe: 0.177929 hartree
zpe.sumelectzpe: -631.081183 hartree
zpe.sumelectthermal: -631.065365 hartree
zpe.sumelectthermalent: -631.064421 hartree
zpe.sumelectthermalfe: -631.126228 hartree
dipole: 4.1557 -0.2659 -0.7809
dipole: 4.2368
quadrupole: -34.1176 -63.4490 -46.1857
quadrupole: -3.4047 -0.1587 -6.6939
quadrupole: 13.7998 -15.5316 1.7317 -3.4047 -0.1587 -6.6939
hfenergy: -631.3041571 hartree
pointgroup: C01 [X(C9H14N1O3)]
dipole: 1.7431785 -0.2222803 -0.2015289 debye
polarizability: 150.4749351|20.7774157|92.9498219|-3.3798176|0.0774703|161.8541576 unknown
InChI: InChI=1/9C.N.3O.14H
charge 1 multiplicity 1
27 atoms
C  0.19887809 0.84411265 -0.49959339
N  1.36198271 1.20608924 -0.48360016
C  -0.02675288 1.17572357 -2.15694372
H  -1.00875582 1.6501177 -2.08271199
H  0.7312698 1.87818728 -2.50870611
O  2.12162239 0.93425977 1.4227256
H  2.6060387 0.0758534 1.36603862
H  2.78486049 1.63398002 1.43312041
O  3.29578351 -1.48749355 1.25536396
H  4.19806237 -1.66354569 0.97202582
H  3.08830913 -2.1412656 1.93032779
C  -0.90805038 0.32091914 0.288513
C  -0.87696581 0.47627035 1.68324375
C  -1.99418772 -0.30254867 -0.34284811
C  -1.94652935 0.01064861 2.43657829
H  -0.03069271 0.95841576 2.15571427
C  -3.04754272 -0.77385927 0.42870852
H  -2.00749013 -0.4462433 -1.41766849
C  -3.02654821 -0.61354319 1.81380488
H  -1.93697451 0.1388206 3.51329964
H  -3.88659433 -1.26465777 -0.05142492
H  -3.85729729 -0.9756427 2.41023904
O  -0.08517676 0.00403981 -2.80959192
C  1.14882727 -0.46391715 -3.36730138
H  1.88361343 -0.62504465 -2.57148348
H  0.91948035 -1.40602894 -3.85996311
H  1.52951987 0.25955367 -4.0941605
