program: Gaussian 09
title: ts
version: EM64L-G09RevD.01
method: RwB97XD
basis: 6-31+G(d,p)
operation: Freq
keyword: #P
keyword: Geom=AllCheck
keyword: Guess=TCheck
keyword: SCRF=Check
keyword: GenChk
keyword: RwB97XD/6-31+G(d,p)
keyword: Freq
converged: YES YES YES YES
title: Mulliken charges:
elementType: C N C H H O H H O H H C H H O C H H H O C H H H
charge: -0.205662 0.021187 -0.131450 0.268280 0.209417 -0.715330 0.479782 0.408715 -0.783312 0.401098 0.404890 0.110320 0.203914 0.220832 -0.338048 -0.181966 0.165027 0.192988 0.162144 -0.201993 -0.262037 0.175548 0.207243 0.188412
chargesum: 1.00000
title: Mulliken charges with hydrogens summed into heavy atoms:
elementType: C N C O O C O C O C
charge: -0.205662 0.021187 0.346248 0.173168 0.022676 0.535066 -0.338048 0.338193 -0.201993 0.309166
polarizability: 1.24821485e+02 7.40308518e+00 7.34144156e+01 3.62887372e+00 1.62732286e+00 9.55211655e+01
1716.lowfreq: -159.5591 -0.0010 -0.0008 -0.0003 4.1306 9.5951 17.9623 20.8736 29.4376
frequency: -159.5463 19.9949 29.1768 48.7207 67.9144 76.7134 106.6955 117.6003 128.3193 142.2278 182.4526 194.1195 205.4416 251.4126 277.4686 289.1556 298.4932 314.5371 397.0427 447.6993 452.0002 497.4484 514.5482 588.3573 602.0807 907.9123 914.9970 952.0766 1002.3704 1020.8067 1036.4119 1181.5275 1187.7430 1188.8789 1190.2750 1249.0540 1258.4162 1287.7282 1310.2164 1336.6820 1400.0906 1482.4801 1486.8631 1497.9854 1501.5948 1505.7889 1508.1909 1521.5419 1529.8144 1639.6286 1669.7704 2031.5443 3018.2762 3048.6164 3058.6746 3092.7783 3096.1700 3128.4534 3151.3469 3197.3718 3205.7352 3226.4886 3466.5134 3888.4543 3923.4338 4000.1403
redmass: 5.7871 4.1999 4.8182 3.3214 2.0473 3.5872 2.5310 1.8140 1.6899 1.5824 2.0180 3.0531 1.3060 4.0132 3.7875 1.3405 2.7083 1.3313 3.4290 2.3490 1.5374 3.2862 2.6434 1.7774 2.5088 1.0820 3.5285 2.9169 1.7659 4.0991 1.6358 1.6412 1.6896 1.2600 1.2873 2.2918 1.1867 1.7355 1.3897 1.6992 1.3409 1.0983 1.1003 1.0619 1.0543 1.0637 1.0506 1.1117 1.2088 1.0840 1.0758 11.3668 1.0610 1.0340 1.0352 1.0595 1.0964 1.1079 1.1053 1.1163 1.1021 1.1043 1.0631 1.0445 1.0687 1.0838
irintensity: 401.4919 0.6837 0.7385 1.7642 14.9398 1.1529 3.3210 5.9327 31.1823 0.2404 0.8880 6.5035 5.3766 1.9961 4.7155 96.5272 147.3098 130.5918 12.7149 13.3480 115.6614 35.1403 42.3546 117.4700 24.8973 159.2104 81.4575 41.5742 20.9853 39.6622 3.3920 80.3363 75.0534 2.2361 3.3833 125.7811 23.2316 212.5088 37.2420 66.6529 39.9929 11.8872 5.1007 14.1547 7.3129 15.8355 13.0093 7.5824 34.3693 145.1399 26.3712 199.5782 16.0022 37.4870 9.0183 23.1937 6.7679 22.7940 18.2870 29.4857 5.3039 1.8868 1441.3506 44.4967 166.7967 136.2064
temp: 298.150 k
press: 1.00000 atm
elementType: 6 7 6 1 1 8 1 1 8 1 1 6 1 1 8 6 1 1 1 8 6 1 1 1
symmnumber: 1
zpe: 529661.3 jmol-1
zpe.correction: 0.201737 hartree
zpe.thermalcorrener: 0.217466 hartree
zpe.thermalcorrenthalpy: 0.218410 hartree
zpe.thermalcorrgfe: 0.156700 hartree
zpe.sumelectzpe: -553.904407 hartree
zpe.sumelectthermal: -553.888679 hartree
zpe.sumelectthermalent: -553.887734 hartree
zpe.sumelectthermalfe: -553.949445 hartree
dipole: 2.6567 -0.2789 -2.0207
dipole: 3.3495
quadrupole: -23.2097 -50.8694 -31.5971
quadrupole: -5.7447 -8.0006 1.5694
quadrupole: 12.0157 -15.6440 3.6283 -5.7447 -8.0006 1.5694
hfenergy: -554.1061445 hartree
pointgroup: C01 [X(C5H14N1O4)]
dipole: 1.2297602 -0.1980726 -0.942712 debye
dipolederiv: -1.5586195 -0.2516461 -0.17135 -0.2318796 0.0790295 -0.0048482 0.45199 0.0566954 0.0620987 2.0199127 0.1761609 0.0831188 0.2726092 -0.1063089 0.0373467 -0.4379529 -0.0381329 -0.2721774 1.5349053 0.3609001 0.61156 0.6149224 0.7828016 0.4652626 1.1188534 0.1882407 0.5235178 -0.1056047 -0.0353652 -0.0214547 -0.0146152 0.0995063 -0.0299372 -0.2411136 -0.0625257 0.1755787 0.0129104 -0.047881 -0.0527561 0.0102396 0.0539523 -0.0140919 -0.0345566 0.0680867 0.0190221 -1.7446274 -0.0138181 -0.0429006 0.3140275 -0.5385482 -0.1249076 -0.1490092 -0.1927488 -0.570082 0.5274166 -0.2035141 -0.1695308 -0.5761889 0.5478427 0.2411873 -0.4804746 0.2270162 0.4529473 0.2910797 0.0055502 0.0188408 0.187854 0.3175713 0.0398591 0.0087151 0.0426441 0.309641 -0.6795082 -0.014494 0.0273435 0.1575972 -0.7005378 -0.1117633 0.1523588 -0.0944851 -0.600291 0.323298 0.0423585 0.0379899 0.0436159 0.3292689 -0.0089049 0.0164746 -0.0049429 0.2990597 0.3146995 0.0551487 0.0165529 0.0252986 0.3353051 -0.0071759 0.0275237 -0.0178034 0.3143574 0.7565483 0.0712703 -0.5358151 -0.068614 0.3310575 0.1067883 -0.3030931 0.0458214 0.8002857 0.0448931 -0.0329141 0.0584742 0.0417563 -0.0240106 -0.0668666 0.0399549 -0.0013087 -0.0336141 0.0024565 -0.0214584 0.0517084 -0.0580164 0.0476628 0.009307 0.0215343 0.0138104 -0.017369 -0.6139347 -0.0126215 0.3872247 0.0199316 -0.4778026 0.1789051 0.2954226 0.1707457 -1.2597517 0.2566902 0.0619253 -0.0214198 0.1166099 0.4143549 -0.3062911 -0.1474221 -0.187427 0.9437483 -0.0445396 -0.0455702 -0.132668 -0.0813007 0.0334606 -0.0011271 -0.0014324 0.0154152 -0.0461383 -0.01042 0.0298202 0.0769146 0.052389 0.07492 -0.0020049 0.0201235 0.0211623 0.0227947 0.0761395 0.0197939 -0.0151177 -0.0214038 -0.1241695 0.0489671 0.0230578 -0.0765707 -0.0185723 -0.7890767 -0.1231198 -0.1722368 -0.8297319 -0.8255526 -0.6349543 -0.4641753 -0.3018461 -0.9300621 0.3350712 -0.0285974 -0.0071022 0.0575748 0.2942311 0.1617682 0.2381672 0.2004772 0.7913681 -0.0825921 -0.0142658 0.0306882 -0.0676593 0.062124 0.001179 -0.1039475 -0.0495458 0.0021763 0.0976905 -0.0373067 -0.0133779 -0.0306513 -0.000904 -0.0437875 -0.0077372 0.010128 0.0487604 0.0352112 0.0596442 -0.0446863 0.0656349 -0.0052545 0.06609 -0.0432615 -0.0329064 -0.0172984 unknown
polarizability: 124.8214852|7.4030852|73.4144156|3.6288737|1.6273229|95.5211655 unknown
InChI: InChI=1/5C.N.4O.14H
charge 1 multiplicity 1
24 atoms
C  -0.23107045 0.63094918 0.1353892
N  0.47356825 1.04437145 -0.74827313
C  -1.79037668 0.76000808 -0.5762678
H  -2.31175014 1.01953785 0.3508694
H  -1.77225153 1.55600326 -1.32230645
O  2.42799199 0.77311605 0.06602793
H  2.87017719 0.14605971 -0.55310193
H  2.84749288 1.63145412 -0.0625554
O  3.58774715 -1.05552158 -1.54806824
H  3.82820008 -0.93794235 -2.47189625
H  4.2207836 -1.67691265 -1.17548906
C  -0.16778536 0.01244538 1.50368813
H  -0.05808188 -1.07273111 1.34758703
H  0.74375435 0.39976756 1.97704397
O  -1.33195491 0.3430439 2.1815695
C  -1.42802132 -0.26921381 3.46589208
H  -0.59719751 0.04318737 4.10837934
H  -2.36824644 0.07061781 3.89601195
H  -1.43819594 -1.36124178 3.37122298
O  -2.11535446 -0.45798388 -1.00738518
C  -1.82582911 -0.73709387 -2.3836278
H  -0.75241415 -0.61317919 -2.56728618
H  -2.1199046 -1.77034927 -2.55187106
H  -2.40094048 -0.06774598 -3.02884716
