program: Gaussian 09
title: ts
version: EM64L-G09RevD.01
method: RwB97XD
basis: 6-31+G(d,p)
operation: Freq
keyword: #P
keyword: Geom=AllCheck
keyword: Guess=TCheck
keyword: SCRF=Check
keyword: GenChk
keyword: RwB97XD/6-31+G(d,p)
keyword: Freq
converged: YES YES YES YES
title: Mulliken charges:
elementType: C N C H H O H H O H H C H H C H H H O C H H H
charge: -0.090440 0.020135 -0.151550 0.230858 0.217292 -0.718469 0.479010 0.402454 -0.781335 0.400594 0.403609 -0.046157 0.221646 0.239126 -0.518956 0.170236 0.213725 0.198177 -0.211426 -0.256644 0.181245 0.211272 0.185599
chargesum: 1.00000
title: Mulliken charges with hydrogens summed into heavy atoms:
elementType: C N C O O C C O C
charge: -0.090440 0.020135 0.296600 0.162996 0.022868 0.414614 0.063182 -0.211426 0.321472
polarizability: 1.17985941e+02 5.49102308e+00 6.97423652e+01 7.34873908e+00 -8.52369232e-01 8.92547729e+01
1716.lowfreq: -261.6384 -0.0011 -0.0004 0.0005 1.3953 6.3649 11.5843 27.0270 29.6403
frequency: -261.6097 26.2437 28.8765 61.9306 67.1693 100.1001 117.4662 128.9758 151.9134 181.9235 204.2002 236.8848 257.8160 276.3179 282.3935 287.4468 313.8034 414.7778 444.9998 472.6917 527.9393 577.9567 636.5964 811.4913 836.8736 895.8422 944.1682 1003.2910 1015.8650 1096.2063 1123.0576 1178.6686 1194.6788 1268.3993 1298.7141 1299.7546 1333.6810 1338.4197 1443.0376 1482.0432 1486.9563 1502.0288 1510.6033 1512.3919 1517.0978 1530.8501 1642.9073 1672.2066 2041.9378 3068.2519 3083.0856 3107.3982 3107.6702 3159.9327 3164.3235 3179.4850 3187.9403 3197.4971 3226.3796 3499.7199 3889.3667 3930.1152 4001.7162
redmass: 6.6987 4.1281 4.9635 3.0864 3.3487 3.1615 1.1448 1.4704 1.7861 2.6043 2.9201 1.6373 3.1101 4.2871 1.7687 1.3250 1.2248 1.6525 1.9622 2.1303 3.3266 1.3208 5.3108 1.1862 3.0468 1.0648 2.8890 1.7542 2.2148 1.7057 1.4596 1.2904 1.2879 1.4635 1.4777 1.3181 1.6314 1.3932 1.1965 1.0871 1.0805 1.0570 1.0385 1.0459 1.0572 1.2361 1.0843 1.0757 11.4818 1.0330 1.0369 1.0559 1.0595 1.1077 1.1040 1.1041 1.1054 1.1168 1.1049 1.0623 1.0444 1.0688 1.0838
irintensity: 444.4591 0.6884 1.2648 1.8248 1.2864 2.0413 19.6195 15.1521 0.1904 1.1594 2.9512 1.2404 4.8203 11.8390 32.7511 167.3622 133.7864 66.7954 43.3299 43.7817 129.9470 36.3073 16.8519 2.4260 58.7034 130.0494 33.4063 27.3116 0.9017 19.4228 23.6738 21.5563 2.3573 170.4375 121.4431 6.2934 57.4432 4.9406 5.0728 13.2454 2.6947 15.4631 12.6014 19.4866 4.9130 26.3720 145.7485 30.4665 176.4256 11.7850 8.1544 4.1962 0.4374 14.1639 8.2538 0.5891 2.0742 9.0087 1.1966 1393.4714 42.5850 147.4114 134.4313
temp: 298.150 k
press: 1.00000 atm
elementType: 6 7 6 1 1 8 1 1 8 1 1 6 1 1 6 1 1 1 8 6 1 1 1
symmnumber: 1
zpe: 517878.2 jmol-1
zpe.correction: 0.197249 hartree
zpe.thermalcorrener: 0.211896 hartree
zpe.thermalcorrenthalpy: 0.212840 hartree
zpe.thermalcorrgfe: 0.154360 hartree
zpe.sumelectzpe: -478.734028 hartree
zpe.sumelectthermal: -478.719382 hartree
zpe.sumelectthermalent: -478.718438 hartree
zpe.sumelectthermalfe: -478.776917 hartree
dipole: 0.7636 0.6695 -1.3371
dipole: 1.6790
quadrupole: -18.3543 -47.5334 -31.4117
quadrupole: -3.4168 -7.8783 1.2931
quadrupole: 14.0788 -15.1003 1.0215 -3.4168 -7.8783 1.2931
hfenergy: -478.9312773 hartree
pointgroup: C01 [X(C5H14N1O3)]
dipole: 0.5530816 0.2709189 -0.6243709 debye
dipolederiv: -1.4622697 -0.2550471 -0.2203135 -0.3174653 0.0890517 -0.2156542 0.2668299 -0.0559 0.2402801 1.932116 0.1777439 0.0999221 0.5123891 -0.1081962 0.1862764 -0.403602 -0.005358 -0.2991597 1.6504644 0.2716004 0.6622166 0.2454191 0.5826082 0.4544086 1.1326369 0.2309155 0.6773826 -0.1194093 -0.0254724 -0.0253086 0.0234461 0.0963393 0.0009823 -0.1372629 -0.0399608 0.0084848 0.0176181 -0.0219926 -0.063602 0.0139223 0.0510093 -0.0103714 -0.0265745 0.0626562 0.0440637 -1.6779711 -0.0106222 0.0109021 0.2555911 -0.427636 -0.0856183 0.021107 -0.1243853 -0.6780376 0.5283159 -0.1247224 -0.2413689 -0.3308885 0.3601305 0.2031943 -0.6315384 0.1752474 0.6400525 0.2756316 -0.00643 0.0154504 0.1536755 0.2802936 0.0210366 0.0664312 0.0256803 0.3318919 -0.6757769 -0.0238958 0.0256084 0.0758668 -0.6204349 -0.1200857 0.1907013 -0.0988353 -0.6909556 0.3188905 0.0238079 0.0533464 0.0329714 0.3334533 0.0068595 0.0334615 0.0112164 0.2970765 0.3087496 0.0451608 0.0365311 0.015393 0.3450272 0.0064154 0.0342989 -0.0046671 0.3093025 0.2032103 0.0848615 -0.0265884 0.0378126 0.1292299 -0.1294069 -0.0213791 -0.0216502 0.1176466 0.0510997 -0.0502066 -0.0343191 -0.0085516 0.0678209 -0.0003765 -0.0498754 -0.039166 0.0264439 0.0421424 0.026421 0.0311051 -0.0294907 0.0639489 0.0256868 0.0613438 0.0207681 0.0102014 0.0856504 0.007609 -0.0302799 -0.0129125 -0.0098861 0.1849433 -0.0084376 0.0322774 0.0777463 -0.0658634 0.076855 0.0073996 0.067528 0.0476112 -0.0445694 -0.0537103 -0.0026189 0.0664396 0.1075665 0.0138801 -0.0010688 0.0142111 0.0232982 0.0351386 0.00726 0.0464029 -0.0155027 0.0056658 -0.0781855 -0.0166526 -0.0589892 0.0103888 -0.0556374 0.0314931 -0.0006353 0.0613771 -0.911521 -0.1157966 -0.2679831 -0.6948805 -0.6285297 -0.5474545 -0.6444017 -0.258359 -1.1280212 0.3203209 -0.0314158 -0.0090709 -0.0150064 0.2433243 0.0386139 0.2809142 0.1080785 0.8709082 -0.0751541 0.0035319 0.039071 -0.0120348 0.0791641 0.0189669 -0.1076155 -0.0264387 -0.0053533 0.0870991 -0.0463063 -0.0271081 -0.0387774 0.0241542 -0.0445909 -0.0115578 0.0020072 0.0457908 0.0534243 0.058622 -0.017889 0.0707708 -0.0321708 0.0712427 -0.0305226 -0.0372755 -0.0080585 unknown
polarizability: 117.9859407|5.4910231|69.7423652|7.3487391|-0.8523692|89.2547729 unknown
InChI: InChI=1/5C.N.3O.14H
charge 1 multiplicity 1
23 atoms
C  -0.48114059 0.24965746 0.56889526
N  0.1580116 0.96412992 -0.15779991
C  -2.04536776 0.6606954 -0.05419482
H  -2.54125822 0.79023281 0.91121153
H  -1.99117185 1.58845684 -0.62605987
O  2.18299002 0.52611666 0.45434283
H  2.6333262 0.18997284 -0.35401324
H  2.56855262 1.38875499 0.64315278
O  3.40256339 -0.5195231 -1.72928252
H  3.61761791 -0.06105788 -2.54684063
H  4.07255058 -1.1995155 -1.61007113
C  -0.41463701 -0.75652252 1.66493939
H  -1.15708734 -1.52942413 1.44767678
H  0.5865508 -1.18875281 1.60568397
C  -0.65797259 -0.10922477 3.03403717
H  -1.65011578 0.34402728 3.1090128
H  -0.59282003 -0.88519526 3.79888364
H  0.09628795 0.64953946 3.24998956
O  -2.48274806 -0.41810973 -0.70205391
C  -2.24035278 -0.44979802 -2.11760535
H  -1.16224569 -0.44806024 -2.30844988
H  -2.6844086 -1.37473565 -2.47764061
H  -2.71448022 0.41102727 -2.59637961
