program: Gaussian 09
title: 000052696
version: EM64L-G09RevD.01
frameworkgroup: C1[X(C10H11BrO)]
method: RPBEPBE
basis: SDD
operation: Freq
keyword: #p
keyword: freq=noraman
keyword: PBEPBE/SDD
title: #p freq=noraman PBEPBE/SDD
converged: YES YES NO NO
title: Mulliken charges:
elementType: Br O C C C C C C C C C C H H H H H H H H H H H
charge: -0.001502 -0.203106 -0.595624 -0.336996 0.201825 0.314082 -0.693580 -0.328480 -0.345841 -0.247108 -0.225896 -0.221383 0.290138 0.255446 0.225427 0.228226 0.248247 0.205939 0.247315 0.277793 0.233721 0.235714 0.235643
chargesum: 0.00000
title: Mulliken charges with hydrogens summed into heavy atoms:
elementType: Br O C C C C C C C C C C
charge: -0.001502 -0.203106 -0.305486 0.143877 0.201825 0.314082 -0.011168 -0.081165 -0.068048 -0.013387 0.009818 0.014260
polarizability: 1.62321318e+02 -5.14694132e+00 1.22035268e+02 2.92394877e+00 -1.47767949e+01 9.33693790e+01
1716.lowfreq: -10.3308 -9.0654 -0.0007 -0.0006 0.0003 3.3126 33.4787 44.6063 100.6741
frequency: 33.4335 44.5638 100.6624 117.7377 136.4319 161.9357 176.0531 226.6549 281.7582 313.8143 362.4548 398.9711 423.5760 473.8126 564.0465 612.8810 633.1649 691.9841 713.2241 721.4442 802.7123 828.4363 855.1373 895.3789 945.2273 981.4825 989.0514 991.7951 1010.8904 1027.2688 1032.5494 1077.9534 1093.1052 1114.1919 1156.8135 1174.9572 1194.0774 1229.9348 1261.4909 1313.3039 1321.3072 1350.4211 1387.0799 1388.4486 1436.2737 1456.9073 1474.6759 1480.1466 1487.3441 1561.9475 1594.6162 1610.2166 2983.5905 3021.7736 3065.9455 3072.9094 3089.9270 3102.2625 3131.2704 3141.3554 3152.1847 3161.4698 3171.5140
redmass: 5.3891 4.3399 3.1213 4.5625 5.5158 3.8558 2.0749 1.5306 4.9371 3.7252 4.0718 2.7904 3.9385 5.3065 5.1922 6.4192 4.1410 2.0927 2.2215 2.6202 2.3310 1.5920 1.2520 2.2924 1.4347 3.1498 3.1091 1.7795 1.3513 2.0113 2.5059 1.4663 1.5357 1.5984 1.6836 1.0624 1.1562 1.9191 1.5691 1.3709 1.3628 1.4475 1.2036 8.9489 2.2724 1.0846 1.0477 2.1989 1.0537 7.6605 6.6020 6.1927 1.0363 1.0609 1.0917 1.0949 1.0984 1.1020 1.0853 1.0881 1.0924 1.0961 1.1013
irintensity: 1.4151 0.6043 0.6963 0.8897 0.7941 0.6436 0.7699 2.4071 6.6524 7.1075 2.3277 0.0823 0.6509 8.4954 32.7882 0.2166 15.0326 42.0759 24.6194 11.2514 30.0123 23.3445 0.7264 40.1633 1.8404 17.0485 4.1324 0.8987 0.5575 2.5291 7.9603 7.6362 12.0897 12.7901 22.2213 1.1912 8.3233 88.9426 77.3764 4.5072 4.3909 28.8303 17.0507 3.3593 23.6582 20.6961 13.9364 1.6997 16.1994 123.1468 34.8353 11.7893 31.1045 15.3348 11.1443 7.2922 29.2274 30.4073 0.1621 5.6388 15.0058 19.5175 19.2206
temp: 298.150 k
press: 1.00000 atm
elementType: 35 8 6 6 6 6 6 6 6 6 6 6 1 1 1 1 1 1 1 1 1 1 1
symmnumber: 1
zpe: 477357.5 jmol-1
zpe.correction: 0.181816 hartree
zpe.thermalcorrener: 0.193823 hartree
zpe.thermalcorrenthalpy: 0.194767 hartree
zpe.thermalcorrgfe: 0.141607 hartree
zpe.sumelectzpe: -475.465891 hartree
zpe.sumelectthermal: -475.453885 hartree
zpe.sumelectthermalent: -475.452940 hartree
zpe.sumelectthermalfe: -475.506100 hartree
dipole: 2.0801 0.0902 2.8044
dipole: 3.4927
quadrupole: -68.4229 -82.8403 -81.1439
quadrupole: -3.6811 -2.6261 -0.3154
quadrupole: 9.0461 -5.3713 -3.6748 -3.6811 -2.6261 -0.3154
hfenergy: -475.6477073 hartree
pointgroup: C01 [X(C10H11Br1O1)]
dipole: 0.8842662 1.0510404 0.0410106 debye
dipolederiv: -0.264202 0.0222775 0.0697546 0.0437227 -0.2288473 0.1817281 0.0754617 0.18595 -0.5455839 -0.8651441 -0.0288284 -0.0725728 -0.1692251 -0.4171163 -0.2978157 -0.3260663 -0.1583529 -0.615242 0.0033511 -0.0246343 0.1716849 0.0491838 0.2974079 -0.384736 0.1240018 -0.3779639 0.4887084 0.0390147 -0.0571173 0.0585054 0.0591495 -0.0088169 0.1455539 -0.0288374 0.1066029 -0.0747812 1.7596016 0.0873971 -0.1083572 0.0237799 0.2335168 0.4647846 0.1319102 0.2734852 0.5870098 -0.8600412 -0.0503492 -0.0455679 0.0630195 -0.0272392 -0.0539542 -0.0671788 -0.0511435 -0.049673 -0.0275 0.1047794 -0.123971 -0.0093008 0.0838493 0.0162522 -0.0045808 0.0461859 -0.0007813 0.1562488 -0.0551143 -0.0747986 0.1126302 -0.074356 0.0371449 0.0901073 0.0577006 -0.0218121 0.0993736 0.0966322 0.1087626 -0.1107006 -0.0544875 0.0646367 -0.1077717 0.0539995 -0.0078753 -0.2353559 0.0748093 0.1054793 0.1012523 -0.0684384 0.1187592 0.1611909 0.1280411 0.0136012 -0.0901457 -0.1332702 -0.153469 -0.1419279 -0.1010059 0.0818723 -0.1816391 0.0661378 -0.0522305 0.1506089 0.0071082 0.0276644 0.0053076 -0.0629561 0.0782486 0.0187329 0.0861689 -0.0193479 0.0183548 -0.0730429 -0.0236324 -0.0766762 -0.0691846 -0.0011001 0.0274417 0.0397142 -0.0305522 0.10722 -0.0253686 -0.0164499 -0.0889466 -0.0577236 -0.0169333 -0.0573008 -0.0102641 0.0588325 -0.0409895 0.0562715 0.0609702 0.0729793 0.0602355 -0.0340885 0.1017891 -0.026129 -0.0382749 -0.1261005 0.0479266 -0.1105857 0.0403391 0.0689358 0.0613989 -0.1086078 0.0633095 0.0089426 0.0288345 0.0222325 0.1305627 0.022007 0.0603709 -0.0774066 0.1181121 -0.0257131 -0.0037411 0.0717907 -0.1118766 -0.0125039 -0.0676856 -0.1201101 -0.024518 -0.0228255 -0.0900427 0.0529626 0.03782 0.0665232 0.0674528 0.0685569 0.0884866 -0.0621123 0.0886771 -0.0606156 0.0433522 0.1231777 -0.0355508 -0.0608212 -0.0057031 0.1002341 -0.0657921 -0.015466 -0.0688616 0.056431 0.0478536 -0.0335247 -0.0434142 -0.0471016 0.0735348 -0.1124616 -0.0690211 -0.1177683 -0.0015418 -0.0173678 0.058664 0.0745843 0.0690257 0.0900509 -0.0878682 0.0850376 -0.0895958 0.0387936 -0.1164033 -0.0159443 -0.0292774 -0.0136858 0.1336597 -0.0315928 -0.0331672 -0.030845 0.1128033 unknown
polarizability: 163.3139995|-0.1746345|88.7734122|0.0580975|8.0047224|125.6385531 unknown
InChI: InChI=1S/C10H11BrO/c1-2-9(11)10(12)8-6-4-3-5-7-8/h3-7,9H,2H2,1H3
charge 0 multiplicity 1
23 atoms
Br -1.99717 -0.514067 2.30255
O  -1.129462 -0.983753 -1.222697
C  -1.754292 0.550849 0.546828
C  -3.112768 0.720123 -0.136991
C  -0.722337 -0.241084 -0.281772
C  0.740633 -0.091174 0.011162
C  -3.01847 1.690098 -1.341927
C  1.244173 0.691288 1.08663
C  1.65814 -0.762495 -0.84469
C  2.634784 0.80088 1.296115
C  3.045656 -0.650111 -0.635519
C  3.538477 0.134259 0.435844
H  -1.35236 1.514174 0.901101
H  -3.466233 -0.267339 -0.48003
H  -3.837801 1.106521 0.601542
H  -4.019948 1.832176 -1.785331
H  -2.356029 1.28691 -2.1267
H  -2.641256 2.685016 -1.038355
H  0.561585 1.193915 1.779176
H  1.252735 -1.364304 -1.664763
H  3.014294 1.399723 2.130908
H  3.743542 -1.169856 -1.300666
H  4.618105 0.22225 0.601084
