program: Gaussian 09
title: ts
version: EM64L-G09RevD.01
method: RwB97XD
basis: 6-31+G(d,p)
operation: Freq
keyword: #P
keyword: Geom=AllCheck
keyword: Guess=TCheck
keyword: SCRF=Check
keyword: GenChk
keyword: RwB97XD/6-31+G(d,p)
keyword: Freq
converged: YES YES YES YES
title: Mulliken charges:
elementType: C N C H H O H H O H H C C C C H C H C H H O C H H H O C H H H
charge: -1.037213 0.014047 -0.204707 0.229240 0.210154 -0.675964 0.486019 0.409839 -0.779298 0.401127 0.403830 1.560094 0.049827 -0.452298 0.182773 0.209682 -0.495675 0.187431 -0.187839 0.176433 0.197125 -0.318670 -0.152426 0.168165 0.192761 0.167221 -0.228544 -0.260837 0.171182 0.199812 0.176709
chargesum: 1.00000
title: Mulliken charges with hydrogens summed into heavy atoms:
elementType: C N C O O C C C C C C O C O C
charge: -1.037213 0.014047 0.234688 0.219895 0.025659 1.560094 0.259509 -0.264867 0.359206 -0.298551 -0.187839 -0.318670 0.375721 -0.228544 0.286865
polarizability: 2.09500522e+02 1.74808751e+01 9.99088699e+01 -1.01902515e+01 5.61777192e+00 1.67257870e+02
1716.lowfreq: -192.5961 -11.2438 -0.0011 -0.0004 0.0001 3.3226 7.2257 16.6317 26.0109
frequency: -192.5939 15.8198 25.8840 38.5063 68.2563 75.8584 98.9171 101.1590 127.2896 137.7574 155.8533 192.7992 211.4376 231.8428 241.4993 265.3566 288.9721 294.9390 300.7469 312.8801 323.9005 393.5857 424.4702 461.6500 482.8528 508.2912 524.3422 550.6831 609.2622 638.9307 649.8613 673.1713 732.2967 733.9380 838.9100 848.7252 866.7006 923.3488 951.4707 999.9690 1010.3556 1013.1764 1026.8816 1080.2453 1167.5172 1171.8972 1187.8144 1190.6206 1208.5402 1216.1016 1229.0577 1280.0562 1299.3193 1349.3090 1353.3471 1362.6185 1386.3914 1481.9831 1489.6718 1495.7708 1507.0845 1510.8267 1511.7198 1519.2770 1520.4975 1576.5205 1628.0299 1643.1299 1670.9310 1675.8131 1897.5390 3059.7418 3060.9246 3104.7124 3144.3637 3146.5091 3181.0776 3210.8595 3220.4378 3243.7505 3258.6158 3262.5329 3275.0636 3435.6355 3889.4619 3915.0382 4001.7873
redmass: 6.9853 4.3058 4.6148 3.6847 4.0681 4.0842 3.5859 1.0452 3.4407 2.4636 2.2547 2.1591 4.2374 2.9402 1.4448 2.4241 2.8060 1.4989 2.9536 1.3168 5.7956 6.4035 3.0226 2.1248 1.6349 2.1899 3.7900 2.2448 5.2573 1.7077 5.4894 4.1269 4.9780 4.4493 1.2545 5.8147 1.7682 1.0959 2.5952 1.2984 1.6188 1.4570 2.7821 6.4853 1.3767 1.4814 1.2723 1.3656 1.7659 1.4062 1.3506 3.2534 1.4895 1.4308 1.7546 2.3182 2.8045 1.0960 2.0203 1.5690 1.0548 1.0514 1.0537 1.0809 1.1799 2.6196 6.2666 1.0851 1.1232 4.4113 10.8710 1.0340 1.0336 1.0564 1.1078 1.1075 1.1140 1.1024 1.1033 1.0901 1.0961 1.0898 1.0957 1.0633 1.0445 1.0685 1.0838
irintensity: 373.1811 1.9578 0.5595 2.2041 0.3716 2.0582 2.3328 20.1000 1.3859 4.8337 2.3487 3.0081 2.8872 7.2842 1.4095 16.5026 30.3583 203.2622 6.7637 69.2543 35.0668 14.4120 1.2653 3.5830 103.4463 39.3815 28.8019 55.1927 18.7824 71.2510 70.6183 16.7873 57.5989 6.7697 2.5571 19.0619 67.5465 122.0574 32.8199 0.7252 10.8051 9.2278 1.6020 68.4443 56.3051 27.7066 1.1312 17.2411 152.4073 43.8617 102.6064 284.0696 34.9880 5.6033 131.1821 4.5141 233.2234 5.0111 4.2286 11.7508 26.0098 22.2414 19.6795 58.5003 0.5282 179.7113 4.2055 156.4066 124.7244 461.9045 377.0232 37.8415 18.7444 4.3817 19.4539 22.0825 6.7345 6.2269 2.8598 0.2102 0.5725 1.3816 11.7856 1428.4238 47.1935 168.1593 130.6031
temp: 298.150 k
press: 1.00000 atm
elementType: 6 7 6 1 1 8 1 1 8 1 1 6 6 6 6 1 6 1 6 1 1 8 6 1 1 1 8 6 1 1 1
symmnumber: 1
zpe: 672269.5 jmol-1
zpe.correction: 0.256054 hartree
zpe.thermalcorrener: 0.274385 hartree
zpe.thermalcorrenthalpy: 0.275329 hartree
zpe.thermalcorrgfe: 0.207587 hartree
zpe.sumelectzpe: -745.549351 hartree
zpe.sumelectthermal: -745.531020 hartree
zpe.sumelectthermalent: -745.530076 hartree
zpe.sumelectthermalfe: -745.597818 hartree
dipole: 5.8461 -0.1069 3.0193
dipole: 6.5806
quadrupole: -26.1501 -76.6701 -54.4030
quadrupole: -2.4320 1.1164 -7.8010
quadrupole: 26.2576 -24.2624 -1.9953 -2.4320 1.1164 -7.8010
hfenergy: -745.8054049 hartree
pointgroup: C01 [X(C10H16N1O4)]
dipole: 2.3414273 -0.1185927 1.319363 debye
polarizability: 209.5005221|17.4808751|99.9088699|-10.1902515|5.6177719|167.2578704 unknown
InChI: InChI=1/10C.N.4O.16H
charge 1 multiplicity 1
31 atoms
C  1.2082201 0.84124496 -0.39664839
N  2.22876583 1.0800212 0.24076491
C  1.93438009 1.10167747 -1.89219487
H  1.17419912 1.74406534 -2.34443429
H  2.87686017 1.64121656 -1.77607073
O  1.86528559 0.84808308 2.2415059
H  2.4075711 0.04853218 2.44692861
H  2.34987676 1.60945114 2.58172449
O  3.25519589 -1.40394121 2.7414255
H  4.21005539 -1.47160107 2.83427353
H  2.87369586 -2.08344887 3.30566028
C  -0.184743 0.4720988 -0.32589733
C  -0.84767455 0.48925628 0.91285044
C  -0.89621575 0.10876393 -1.48921518
C  -2.1916112 0.16719024 0.9930833
H  -0.30558872 0.76297957 1.80897434
C  -2.22925829 -0.22013822 -1.4093314
H  -0.40006024 0.05092989 -2.45134533
C  -2.89461338 -0.18956828 -0.16916723
H  -2.68357607 0.19834521 1.95687031
H  -2.78899271 -0.50986448 -2.2909361
O  -4.18583404 -0.51554863 -0.20128159
C  -4.94491467 -0.51026169 1.00417849
H  -4.96052055 0.48885848 1.45060102
H  -5.95420581 -0.79532196 0.71437839
H  -4.54817886 -1.2400083 1.71716315
O  2.0256892 -0.08524407 -2.52635758
C  3.25892712 -0.78891959 -2.35066778
H  3.42129952 -1.00760233 -1.28984132
H  3.1599951 -1.71656281 -2.91013449
H  4.09045427 -0.19731476 -2.74579648
