program: Gaussian 09
title: ts
version: EM64L-G09RevD.01
method: RwB97XD
basis: 6-31+G(d,p)
operation: Freq
keyword: #P
keyword: Geom=AllCheck
keyword: Guess=TCheck
keyword: SCRF=Check
keyword: GenChk
keyword: RwB97XD/6-31+G(d,p)
keyword: Freq
converged: YES YES YES YES
title: Mulliken charges:
elementType: C N C H H O H H O H H C H H O C H H H C F F F
charge: -0.046681 0.094767 -0.567910 0.318187 0.307772 -0.808175 0.456789 0.396736 -0.780901 0.397761 0.402086 0.101272 0.227336 0.248972 -0.352482 -0.176785 0.173572 0.199658 0.169151 1.003820 -0.243501 -0.272218 -0.249227
chargesum: 1.00000
title: Mulliken charges with hydrogens summed into heavy atoms:
elementType: C N C O O C O C C F F F
charge: -0.046681 0.094767 0.058049 0.045351 0.018946 0.577580 -0.352482 0.365597 1.003820 -0.243501 -0.272218 -0.249227
polarizability: 9.97161408e+01 1.39325528e+00 6.98943755e+01 4.22285518e-01 -5.11061868e+00 8.77032338e+01
1716.lowfreq: -360.7192 0.0001 0.0003 0.0009 7.0916 9.3130 13.5732 21.3822 23.2416
frequency: -360.7192 19.3466 21.5239 45.6306 49.9899 66.1227 87.1101 108.7569 119.3889 124.1794 171.8063 181.5547 209.4328 228.9489 267.0702 283.5127 288.8519 297.3241 328.3769 372.3359 393.3122 408.7606 490.0812 502.7021 524.3730 540.6131 639.2889 681.0038 822.6915 827.3424 860.3995 910.7194 1008.2375 1030.4906 1132.0160 1179.0635 1194.2416 1206.1311 1240.5042 1248.8105 1273.0159 1312.1742 1339.9370 1395.9892 1426.7126 1487.5592 1500.2339 1507.6931 1525.9692 1638.2128 1673.7778 2153.7969 3020.6367 3033.3422 3056.2269 3092.5075 3139.9553 3205.0499 3217.9548 3588.1789 3888.6935 3953.9239 4001.0055
redmass: 6.4977 5.2976 5.3486 10.9975 4.3645 6.5471 3.2081 1.9826 1.6036 2.2706 4.8656 6.7266 7.7440 1.2313 2.7282 1.5203 1.1791 3.6836 1.2246 2.5318 3.9389 4.0925 1.1020 5.5291 7.0041 9.7468 6.8473 7.2735 2.1187 1.0652 6.6272 4.1356 4.4129 1.6397 1.4282 2.4351 1.2823 2.2027 1.1855 2.2246 4.7435 3.3969 1.7369 1.3576 1.3100 1.0917 1.0947 1.0410 1.0860 1.0847 1.0772 12.0082 1.0731 1.0582 1.0341 1.1042 1.1084 1.0930 1.1030 1.0604 1.0445 1.0692 1.0837
irintensity: 105.4226 1.6376 0.9344 1.0272 0.6389 1.2122 4.9790 7.0167 19.9160 14.5826 5.7189 7.5074 17.5478 5.5302 36.7923 237.7532 23.9185 8.5533 92.6163 15.4924 1.8534 13.2976 87.4360 1.3583 0.2096 5.4798 36.7953 0.3201 16.1812 121.8881 9.6404 5.0379 39.7825 10.5488 106.0831 136.0461 15.9802 207.1588 13.3421 85.5513 154.1822 199.8306 72.7810 27.2685 46.8692 5.0757 9.8926 16.8673 16.8302 149.9370 20.2664 44.8179 68.0673 39.9083 25.7355 0.5689 18.2849 49.1203 2.3539 935.0543 36.2055 130.8761 129.9629
temp: 298.150 k
press: 1.00000 atm
elementType: 6 7 6 1 1 8 1 1 8 1 1 6 1 1 8 6 1 1 1 6 9 9 9
symmnumber: 1
zpe: 451857.0 jmol-1
zpe.correction: 0.172103 hartree
zpe.thermalcorrener: 0.189055 hartree
zpe.thermalcorrenthalpy: 0.189999 hartree
zpe.thermalcorrgfe: 0.124688 hartree
zpe.sumelectzpe: -776.382901 hartree
zpe.sumelectthermal: -776.365950 hartree
zpe.sumelectthermalent: -776.365006 hartree
zpe.sumelectthermalfe: -776.430317 hartree
dipole: 4.7805 1.3133 2.5304
dipole: 5.5660
quadrupole: -28.9408 -57.5592 -47.9033
quadrupole: -8.3767 -8.8509 -1.9048
quadrupole: 15.8603 -12.7581 -3.1022 -8.3767 -8.8509 -1.9048
hfenergy: -776.5550047 hartree
pointgroup: C01 [X(C5H11F3N1O3)]
dipole: 1.7793353 0.4901921 1.0801703 debye
dipolederiv: -0.3167444 -0.147114 0.1393893 -0.1293504 0.1923556 -0.0596686 0.2091339 -0.0233598 0.3373155 1.1652298 0.067154 -0.0358561 0.2475171 -0.0414785 0.0487991 -0.3431392 -0.0239316 -0.2221374 0.080409 0.1052144 0.1817587 -0.1290299 -0.0949034 0.0494066 0.5659379 0.0545113 -0.0875405 -0.0329965 -0.0521189 -0.0489482 -0.1011967 0.1581725 -0.092809 -0.2322664 -0.0558057 0.2400889 0.1539001 -0.0399004 -0.0419413 -0.0793329 0.1783276 -0.0661897 -0.0294401 -0.0204318 0.13306 -1.08467 0.1042338 0.0335068 0.2068531 -0.6732774 -0.0943277 -0.052889 -0.115552 -0.6521731 0.4335089 -0.1993813 -0.121948 -0.3781126 0.5882088 0.2073374 -0.2509288 0.1996877 0.4092771 0.2523706 -0.0278657 0.0154405 0.0679696 0.305447 0.0084828 0.0175463 0.0142198 0.3306751 -0.6543691 -0.0243082 0.0223718 0.0705996 -0.7253798 -0.0834738 0.0701251 -0.0706117 -0.5674442 0.3321708 0.0485907 0.0322554 0.0422286 0.3288393 -0.0145939 0.0230784 -0.0124427 0.2871448 0.3113016 0.060158 0.0099941 0.0494827 0.3290672 -0.0118213 0.0189424 -0.0209865 0.3159176 0.6346741 0.1362121 -0.54816 -0.0404742 0.3020302 0.063269 -0.2181003 0.0113693 0.5819619 0.0638179 -0.0420304 0.0747887 0.0434605 0.0297808 -0.0576416 0.0274262 0.0071333 0.0037658 0.0604444 -0.0297167 0.0782732 -0.02779 0.0538962 0.0313622 -0.0234681 0.0156002 0.0122591 -0.6382811 -0.0742347 0.3595219 -0.03782 -0.5084204 0.2608318 0.2790141 0.2368894 -1.1344549 0.2374732 0.0652597 -0.0608264 0.1223887 0.4451633 -0.3195487 -0.1526322 -0.2254149 0.8996418 -0.0120944 -0.0465494 -0.1199957 -0.0836715 0.025284 -0.0139903 -0.0052144 0.016584 -0.0429586 -0.0089355 0.0153093 0.0622618 0.0412098 0.0836262 0.0146574 0.0064435 0.0309403 0.0425693 0.0767472 0.0477045 -0.0064444 -0.0028137 -0.0973425 0.0347023 0.0388438 -0.0753112 -0.0160239 1.5946562 -0.0452319 0.0600164 0.2902478 1.4218981 0.0957871 0.2552412 -0.0377538 1.7699253 -0.961898 0.0298858 -0.1835327 -0.1432168 -0.2897863 -0.0849018 -0.2378396 -0.0257692 -0.3530109 -0.3171929 0.0554141 -0.1008737 0.0116135 -0.7225759 0.2007805 -0.104011 0.1626637 -0.4673982 -0.3695218 -0.0066846 0.1989479 -0.0407622 -0.2889326 -0.1164496 0.1381963 -0.0422282 -0.8204602 unknown
polarizability: 99.7161408|1.3932553|69.8943755|0.4222855|-5.1106187|87.7032338 unknown
InChI: InChI=1/5C.3F.N.3O.11H
charge 1 multiplicity 1
23 atoms
C  0.3253035 0.72956952 0.28859749
N  0.7565495 1.27682523 -0.68110046
C  -1.11495683 1.02470511 -0.55533166
H  -1.66989567 1.09711438 0.39631887
H  -1.23136347 1.95769171 -1.10577698
O  2.9616916 0.9371916 0.29589206
H  3.45867071 0.25283219 -0.1987088
H  3.53594482 1.70689459 0.34599754
O  4.18530029 -1.10375635 -1.05310211
H  4.34459705 -1.11556867 -2.00149967
H  4.85929734 -1.66286625 -0.65541025
C  0.3682467 0.05398804 1.61924634
H  0.6034911 -1.00471761 1.43100094
H  1.2108137 0.52113415 2.14852951
O  -0.87089635 0.25462949 2.20775757
C  -1.02468253 -0.4265393 3.45775613
H  -0.29589289 -0.05909717 4.18717398
H  -2.03289052 -0.20207176 3.79949454
H  -0.91144981 -1.50688532 3.31835757
C  -1.51068313 -0.20091612 -1.37659248
F  -2.82346498 -0.14152618 -1.5859302
F  -1.22445884 -1.32815896 -0.70797371
F  -0.8764477 -0.2330181 -2.54375664
