program: Gaussian 09
title: ts
version: EM64L-G09RevD.01
method: RwB97XD
basis: 6-31+G(d,p)
operation: Freq
keyword: #P
keyword: Geom=AllCheck
keyword: Guess=TCheck
keyword: SCRF=Check
keyword: GenChk
keyword: RwB97XD/6-31+G(d,p)
keyword: Freq
converged: YES YES NO YES
title: Mulliken charges:
elementType: C N C H H O H H O H H C H H C C C C H C H N H H F
charge: -1.275048 0.068589 -0.458007 0.245658 0.297517 -0.801047 0.430396 0.398460 -0.771032 0.397929 0.399325 0.090203 0.202943 0.190520 0.850161 1.005485 0.200598 -0.560315 0.210138 -0.398613 0.178526 -0.038416 0.194450 0.199159 -0.257579
chargesum: 1.00000
title: Mulliken charges with hydrogens summed into heavy atoms:
elementType: C N C O O C C C C C C N F
charge: -1.275048 0.068589 0.085168 0.027809 0.026221 0.483666 0.850161 1.215623 0.379124 -0.365865 -0.199454 -0.038416 -0.257579
polarizability: 1.36697895e+02 2.33063367e+00 7.85642035e+01 -5.67441564e+00 -1.07736339e+01 1.40277532e+02
1716.lowfreq: -238.9235 -10.3170 -5.1989 0.0008 0.0010 0.0014 7.5614 14.7878 23.8330
frequency: -238.9225 12.9397 23.3277 47.9557 55.2100 63.4291 95.8325 100.3534 159.0251 172.2507 207.0653 227.0595 241.9150 248.5024 257.7089 274.4932 311.8205 354.5426 376.6430 421.6416 459.0372 496.9853 518.3799 590.4554 626.6814 679.2030 716.9011 742.3535 751.4954 786.7245 836.0383 893.2425 1007.1952 1020.0309 1031.1724 1033.2749 1055.5987 1106.5495 1114.6324 1136.9182 1199.1316 1213.4076 1251.8834 1267.0969 1296.8319 1302.0874 1367.1665 1425.3193 1459.6214 1468.8845 1529.2006 1537.2543 1633.4279 1638.0012 1648.1985 1667.6667 2107.1364 3100.0084 3107.9327 3157.8909 3174.2079 3232.9357 3235.4023 3251.1940 3268.2970 3682.2231 3880.6354 3965.7224 3990.6175
redmass: 5.5415 4.3799 3.9594 5.5401 7.3543 6.3483 2.8668 4.2882 6.2261 5.3816 1.1686 3.1945 2.2314 1.4594 1.6381 2.2209 5.5832 1.1816 2.4267 6.0639 3.4282 1.4529 3.7297 4.4812 5.1711 6.1383 1.0928 3.3522 1.5800 3.5665 1.3496 1.2457 1.3441 7.2133 1.4348 1.4518 2.8856 1.9852 7.3455 1.5654 3.5236 1.2816 1.2574 1.2705 7.0807 1.1279 1.3519 1.2020 1.9075 1.1696 1.0845 2.1036 1.2833 3.4625 5.4537 1.0848 12.0693 1.0595 1.0634 1.1024 1.1096 1.0909 1.0920 1.0968 1.0964 1.0578 1.0447 1.0718 1.0832
irintensity: 70.2303 0.1660 1.6118 2.1542 4.2551 2.5491 5.3822 4.0933 8.1551 15.3558 31.1176 10.3520 8.1910 10.1599 55.6646 43.1037 19.9192 200.4544 13.4642 11.2047 17.2093 102.7142 60.8833 14.9661 16.7827 1.6205 98.5607 4.0025 0.7864 11.8382 42.7353 6.3235 0.8081 2.4981 29.2894 5.2549 34.5676 4.4884 93.1957 3.5622 50.2033 14.4651 6.2763 3.1327 24.3957 2.5082 4.3323 20.8967 34.6475 27.1866 2.2806 0.1533 87.5756 73.9375 5.0712 40.8419 172.1746 21.6975 9.9811 42.5011 2.2566 6.9628 0.0646 0.3051 31.1356 559.7001 39.7063 128.2796 125.9780
temp: 298.150 k
press: 1.00000 atm
elementType: 6 7 6 1 1 8 1 1 8 1 1 6 1 1 6 6 6 6 1 6 1 7 1 1 9
symmnumber: 1
zpe: 516272.2 jmol-1
zpe.correction: 0.196638 hartree
zpe.thermalcorrener: 0.212816 hartree
zpe.thermalcorrenthalpy: 0.213760 hartree
zpe.thermalcorrgfe: 0.150013 hartree
zpe.sumelectzpe: -671.133044 hartree
zpe.sumelectthermal: -671.116865 hartree
zpe.sumelectthermalent: -671.115921 hartree
zpe.sumelectthermalfe: -671.179668 hartree
dipole: 3.8350 -0.0291 1.6445
dipole: 4.1728
quadrupole: -56.6189 -66.3478 -39.1295
quadrupole: -3.3929 13.9329 -11.0843
quadrupole: -2.5868 -12.3157 14.9025 -3.3929 13.9329 -11.0843
hfenergy: -671.3296813 hartree
pointgroup: C01 [X(C8H12F1N2O2)]
dipole: 1.5146262 -0.0137847 0.6545377 debye
dipolederiv: 0.8500359 0.0081538 -0.7877869 0.080326 0.2325268 -0.0702013 -0.7362815 -0.136486 0.2663088 -0.0690723 0.0898618 0.9654945 0.0376028 -0.1123692 0.0707499 0.6062922 0.0941072 0.433828 -0.2840065 -0.0648252 -0.102145 -0.0694635 0.0039785 0.0774318 0.0916736 0.17806 0.3617485 0.1047525 0.0398712 -0.0877742 0.0305455 0.0665398 -0.21001 -0.067155 -0.0776808 -0.0507378 0.1878154 -0.0074401 -0.078932 0.0263 0.144966 -0.0946914 0.0117929 -0.0192425 0.1507411 -0.6068785 0.0115976 -0.0729108 -0.0012922 -0.6627299 0.0845545 -0.1712244 0.0060507 -0.9628979 0.2991671 0.0305125 -0.056435 -0.0484234 0.4590188 -0.3338971 -0.0161972 -0.2008699 0.5009495 0.2761283 -0.0331204 -0.0140552 0.0020671 0.3358093 0.0426301 -0.0349281 0.0112504 0.2526468 -0.643482 -0.0743128 -0.0211622 -0.0356734 -0.6285342 0.1199875 -0.0596613 0.0652564 -0.6348321 0.342216 0.0279531 0.0076268 0.0263624 0.3076621 0.0206836 -0.0039655 0.0370337 0.2837747 0.3477996 0.0141348 0.0153743 0.019443 0.3159909 0.0211156 0.0082978 0.0126762 0.281353 0.3487687 0.0281519 0.0126043 0.0107652 0.4413443 0.3119018 -0.0320497 0.0499502 0.9858148 0.0147168 0.048062 -0.040782 0.009345 0.0340704 0.0115461 -0.0196325 -0.0034189 0.0031937 -0.0314009 -0.0451357 0.0545624 -0.0172255 0.0500149 0.0184967 0.0270991 0.0172435 0.0002492 -0.229522 -0.10162 0.2843627 -0.1215155 0.0398142 -0.036129 0.4335827 -0.0293796 0.0540243 -0.0689242 -0.1026531 0.3183068 0.1173445 -0.0366888 0.0739931 -0.2696503 0.0948541 -0.18633 -0.1250988 0.1517642 -0.3625449 -0.0244999 -0.0409261 0.0019003 0.143876 -0.0160401 -0.0712405 0.0157992 0.143278 -0.3830205 -0.0136233 0.0894922 -0.1051023 0.0184161 -0.1326794 0.3754243 0.1385696 0.0080521 0.0547015 0.0026307 0.1328624 -0.0197244 0.0584796 -0.0090396 0.1609646 0.4547341 -0.130375 0.2632966 -0.0348246 0.0323081 0.031603 -0.0135572 0.0394388 -0.0693745 0.1094278 -0.0213157 0.0292241 -0.009344 0.1191315 0.0490963 0.0174693 0.0497083 0.0066368 -0.3276936 -0.0299417 0.1058337 -0.0027027 -0.2358037 -0.0413383 0.0486729 -0.0318314 -0.1748223 0.0747998 0.0020645 0.0043444 0.0104831 0.0975145 0.0388906 -0.017842 0.0406188 0.0124751 0.0394477 0.0215747 -0.0385593 0.011167 0.1075366 0.0284321 -0.0281823 0.0248698 0.0560916 -0.2180997 -0.0142925 -0.0696242 -0.0057943 -0.2935293 -0.0919191 0.004675 -0.0644501 -1.0359894 unknown
polarizability: 136.6978947|2.3306337|78.5642035|-5.6744156|-10.7736339|140.2775323 unknown
InChI: InChI=1/8C.F.2N.2O.12H
charge 1 multiplicity 1
25 atoms
C  0.65411299 0.47026256 -0.57140489
N  1.84680137 0.582154 -0.64819161
C  0.90391928 0.52575944 -2.26144957
H  0.14083387 1.29097983 -2.44278308
H  1.83742826 0.93332097 -2.65735213
O  2.26737715 0.9671665 1.71854016
H  2.34443214 0.33141603 2.45231595
H  3.03174264 1.54764924 1.76641033
O  1.87907221 -0.96895404 3.66062802
H  2.38729007 -1.78191539 3.74550085
H  1.69167814 -0.67713875 4.55868661
C  0.6261571 -0.86855581 -2.81455199
H  1.46147443 -1.5404709 -2.60135715
H  -0.30747338 -1.29175969 -2.43469197
C  -0.62706199 0.27657321 0.07151627
C  -0.63823495 -0.23998456 1.37023955
C  -1.82522712 0.58283383 -0.57918062
C  -1.88706881 -0.42110421 1.962076
H  0.27142414 -0.49043881 1.90256798
C  -3.00639425 0.36508946 0.12310251
H  -1.86369792 0.98067599 -1.58728582
N  -3.0407222 -0.12839337 1.36234975
H  -1.95575274 -0.82507947 2.9673499
H  -3.96408635 0.59219792 -0.33445
F  0.51161852 -0.69499639 -4.17384894
