program: Gaussian 09
title: 000052687
version: EM64L-G09RevD.01
frameworkgroup: C1[X(C3H6N2OS)]
method: RPBEPBE
basis: SDD
operation: Freq
keyword: #p
keyword: freq=noraman
keyword: PBEPBE/SDD
title: #p freq=noraman PBEPBE/SDD
converged: NO YES NO NO
title: Mulliken charges:
elementType: S O N N C C C H H H H H H
charge: 0.188749 -0.263750 -0.049366 0.065048 -0.311303 -0.670595 -0.613639 0.269380 0.242594 0.272663 0.279896 0.298296 0.292026
chargesum: 0.00000
title: Mulliken charges with hydrogens summed into heavy atoms:
elementType: S O N N C C C
charge: 0.188749 -0.263750 -0.049366 0.065048 0.200671 -0.118036 -0.023317
polarizability: 8.52987083e+01 -4.63933146e+00 6.69615446e+01 -3.03118454e+00 -2.07269695e+00 4.51727839e+01
1716.lowfreq: -29.9970 -12.5217 -8.7323 -0.0005 0.0028 0.0033 57.3016 111.5387 250.9013
frequency: 57.1921 111.5135 250.9009 310.3176 353.5042 449.1460 486.0791 601.2417 638.7535 704.7827 817.0296 874.1782 900.2865 956.6434 969.1918 1025.1021 1117.7744 1146.2353 1201.8865 1245.3604 1265.2432 1288.8921 1324.7612 1357.5255 1452.4564 1455.1283 1464.5310 3015.1266 3038.6372 3049.8613 3096.8182 3115.7121 3132.4207
redmass: 5.5124 2.8001 4.7892 3.6332 3.4398 10.5172 4.4152 7.1188 4.0802 3.1875 4.1980 1.9289 1.3948 2.3057 2.5883 1.5311 1.2316 1.6796 1.6117 1.4135 1.5274 1.7630 1.2327 6.3896 1.0809 1.0885 1.0916 1.0623 1.0541 1.0576 1.1015 1.1103 1.1104
irintensity: 6.2187 3.9883 5.5167 2.2988 6.1242 8.6389 1.2474 7.6094 3.4599 4.0150 27.5081 17.8142 9.6981 117.8142 2.7049 77.9464 1.4495 10.4697 16.4435 33.9260 41.3654 32.0709 1.9826 111.4363 15.3701 9.5681 3.1584 27.1423 15.8640 20.5287 3.9273 6.7499 12.0554
temp: 298.150 k
press: 1.00000 atm
elementType: 16 8 7 7 6 6 6 1 1 1 1 1 1
symmnumber: 1
zpe: 252856.1 jmol-1
zpe.correction: 0.096308 hartree
zpe.thermalcorrener: 0.103273 hartree
zpe.thermalcorrenthalpy: 0.104218 hartree
zpe.thermalcorrgfe: 0.064300 hartree
zpe.sumelectzpe: -700.076322 hartree
zpe.sumelectthermal: -700.069356 hartree
zpe.sumelectthermalent: -700.068412 hartree
zpe.sumelectthermalfe: -700.108329 hartree
dipole: -2.8271 2.0093 1.4368
dipole: 3.7543
quadrupole: -61.1356 -45.0546 -47.6914
quadrupole: -3.1598 2.3093 -1.4503
quadrupole: -9.8417 6.2392 3.6024 -3.1598 2.3093 -1.4503
hfenergy: -700.1726295 hartree
pointgroup: C01 [X(C3H6N2O1S1)]
dipole: 1.1357632 -0.6343356 0.6995036 debye
dipolederiv: -0.2128436 0.0591861 0.0022861 0.0620378 -0.1294728 -0.035414 0.0517664 -0.0163425 -0.1715545 -0.873644 -0.0048442 -0.2844232 0.7897143 -0.3346023 0.3150208 -0.2558583 -0.0267528 -0.3059727 -0.9898273 0.067108 -0.2083431 -0.261602 -0.1457351 -0.1143587 -0.4269977 0.0902635 -0.4406866 1.3681421 -0.0324579 0.674965 -0.4455126 0.0177108 -0.1249217 0.8008907 -0.0046214 0.2953437 0.3536542 -0.0583506 0.0484589 -0.2337012 0.0859592 -0.0953174 -0.046062 -0.1469892 0.2819427 -0.0541448 -0.0504809 0.0502407 -0.1276939 0.2585686 0.0971018 0.0605827 0.1049921 0.0960277 0.3322103 -0.0367887 -0.1617866 0.1795103 0.100248 0.0640288 -0.2103745 0.025748 0.2722582 0.0729332 -0.1194849 -0.0161807 -0.0196375 -0.0249645 -0.0137144 -0.0031876 -0.0382686 0.1014509 0.0000539 0.043941 -0.0424108 0.0437738 0.0775297 -0.0075856 -0.0267992 0.064768 -0.1192028 -0.0536667 0.0734949 -0.0499213 0.0804076 0.0058538 0.007021 -0.0492798 0.0288761 0.0829179 0.0676624 -0.0398314 -0.029742 0.0046803 -0.0406546 -0.0663869 0.0308382 -0.0599182 -0.0880928 0.0362695 0.1016694 -0.0267888 -0.018317 0.0665775 0.00701 0.0131497 0.0516515 0.0709334 -0.0467991 -0.0031609 0.0436459 -0.0536599 0.0629817 -0.0324837 0.0613314 -0.0734065 -0.0753651 unknown
polarizability: 85.2078768|-2.4226314|66.2714077|6.717045|1.4677923|45.9537523 unknown
InChI: InChI=1S/C3H6N2OS/c6-4-5-1-2-7-3-5/h1-3H2
charge 0 multiplicity 1
13 atoms
S  1.897362 1.154444 -0.136155
O  -2.328165 0.417112 -0.75444
N  -0.410913 -0.199247 0.259461
N  -1.556937 -0.561843 -0.455812
C  0.626666 -1.231016 0.436834
C  1.863594 -0.74458 -0.354293
C  0.056278 1.178373 0.42539
H  0.227918 -2.188311 0.06386
H  0.871581 -1.329941 1.509955
H  2.80252 -1.148895 0.052523
H  1.777461 -0.971931 -1.427648
H  -0.552427 1.842398 -0.208518
H  0.027862 1.498438 1.478343
