program: Gaussian 09
title: ts
version: EM64L-G09RevD.01
method: RwB97XD
basis: 6-31+G(d,p)
operation: Freq
keyword: #P
keyword: Geom=AllCheck
keyword: Guess=TCheck
keyword: SCRF=Check
keyword: GenChk
keyword: RwB97XD/6-31+G(d,p)
keyword: Freq
converged: YES YES NO YES
title: Mulliken charges:
elementType: C N C H H O H H O H H C H H C C C C H C H C H H O C H H H F
charge: -1.218273 0.034222 -0.460590 0.244678 0.289330 -0.799012 0.456526 0.388763 -0.779942 0.396194 0.397512 0.082956 0.197127 0.183635 1.568439 0.232791 -0.268591 -0.167653 0.242001 -0.174777 0.169811 -0.207380 0.185061 0.204264 -0.310328 -0.164330 0.173394 0.197556 0.171861 -0.265245
chargesum: 1.00000
title: Mulliken charges with hydrogens summed into heavy atoms:
elementType: C N C O O C C C C C C C O C F
charge: -1.218273 0.034222 0.073418 0.046277 0.013763 0.463718 1.568439 0.474792 -0.098780 0.017408 0.029487 -0.207380 -0.310328 0.378481 -0.265245
polarizability: 2.10961689e+02 1.36775477e+01 9.00526220e+01 -9.49464153e+00 3.11853770e-01 1.48468064e+02
1716.lowfreq: -218.3173 -5.6183 -4.7739 0.0008 0.0010 0.0011 6.7246 19.5584 21.7251
frequency: -218.3133 19.5137 21.5735 38.1359 57.6238 67.1265 91.1357 112.0427 119.7119 125.3761 146.4867 153.0302 221.6421 236.4434 242.8810 255.1401 259.6033 268.3866 278.2921 291.4589 317.3210 334.5398 400.8297 425.5719 461.7851 506.6265 516.2741 534.2190 574.3577 636.7870 645.9299 701.1779 721.8747 768.6343 795.3910 847.2852 848.8136 875.5865 999.7649 1023.9108 1032.9886 1037.1364 1059.5013 1071.4528 1106.0340 1168.8491 1173.2909 1206.0413 1209.4082 1221.6119 1237.3347 1257.4196 1313.0833 1353.9256 1364.1054 1382.6577 1426.1723 1464.4404 1482.6005 1498.4671 1510.2661 1516.6152 1541.2190 1573.0066 1620.2755 1642.0927 1670.6690 1674.6625 2035.6703 3065.3259 3103.2034 3109.4269 3152.7596 3160.6252 3177.5541 3218.7733 3225.6920 3234.8624 3254.9501 3261.2581 3626.7510 3894.6559 3957.5936 4008.9984
redmass: 5.3154 4.9259 5.1736 4.1951 7.2173 5.7952 4.4145 1.2797 2.5906 2.6131 4.0821 5.5155 2.2340 1.8515 1.4692 2.1762 3.4905 2.5260 1.2883 3.0430 4.4266 1.3181 6.7611 2.8864 1.1317 4.2492 3.6022 3.8295 4.6854 4.9791 5.2546 3.7979 3.6452 1.6842 1.0602 4.7866 1.3324 1.6478 1.2868 2.7167 1.4422 1.2949 2.8448 6.7645 7.4495 1.3061 1.2754 1.6221 1.4090 1.2905 1.5834 1.4235 1.0773 1.3088 5.0901 3.4322 1.1437 1.2292 1.2187 1.9225 1.4511 1.0447 1.0865 2.7880 6.3772 1.0872 1.2586 3.1323 11.7849 1.0334 1.0620 1.0618 1.1086 1.1009 1.1098 1.1029 1.0908 1.0938 1.0958 1.0937 1.0594 1.0444 1.0697 1.0837
irintensity: 83.6600 0.6710 0.2533 0.6241 3.3764 0.7653 2.2651 8.7473 8.4296 17.9732 6.0332 5.5110 1.2579 18.5545 138.4139 44.1476 48.8176 44.8595 23.5895 5.8085 19.7246 101.8771 1.4092 2.2040 53.2987 50.2677 7.7656 0.6895 18.7929 10.8228 3.1683 3.0618 0.3662 6.5120 120.3114 11.0980 4.9572 68.8378 0.2332 3.8191 39.6263 1.8698 44.4453 59.4222 112.1748 4.4345 1.1313 323.7031 24.2620 7.9869 4.0772 17.9991 6.3239 2.6888 100.5908 298.0256 28.9675 11.3632 8.7744 39.6304 25.4157 15.1781 2.4375 184.0967 7.7684 179.5496 212.0982 435.3522 503.0355 31.3558 26.1369 3.4183 15.7836 42.2976 1.0297 4.3518 1.6826 42.5771 0.7038 5.6804 917.5466 35.1868 110.0966 118.7678
temp: 298.150 k
press: 1.00000 atm
elementType: 6 7 6 1 1 8 1 1 8 1 1 6 1 1 6 6 6 6 1 6 1 6 1 1 8 6 1 1 1 9
symmnumber: 1
zpe: 635490.5 jmol-1
zpe.correction: 0.242046 hartree
zpe.thermalcorrener: 0.260811 hartree
zpe.thermalcorrenthalpy: 0.261755 hartree
zpe.thermalcorrgfe: 0.192628 hartree
zpe.sumelectzpe: -769.577802 hartree
zpe.sumelectthermal: -769.559037 hartree
zpe.sumelectthermalent: -769.558092 hartree
zpe.sumelectthermalfe: -769.627219 hartree
dipole: 2.4280 0.1840 3.9880
dipole: 4.6726
quadrupole: -31.4208 -80.4632 -53.4242
quadrupole: 1.0931 11.5317 -7.8347
quadrupole: 23.6819 -25.3605 1.6786 1.0931 11.5317 -7.8347
hfenergy: -769.8198475 hartree
pointgroup: C01 [X(C10H15F1N1O3)]
dipole: 0.919334 0.0681596 1.5432671 debye
polarizability: 210.961689|13.6775477|90.052622|-9.4946415|0.3118538|148.4680641 unknown
InChI: InChI=1/10C.F.N.3O.15H
charge 1 multiplicity 1
30 atoms
C  1.2623165 0.60610096 -0.26649532
N  2.35198522 0.79984062 0.22546068
C  2.25764596 0.62117113 -1.63278667
H  1.63504605 1.30967625 -2.21479162
H  3.24227532 1.09003341 -1.56933032
O  1.77011438 0.83606424 2.60120983
H  2.39537507 0.20360334 3.00722911
H  1.96225204 1.69084311 2.99743445
O  3.49167155 -1.01238998 3.72317212
H  4.45187221 -0.96815822 3.71477079
H  3.24737901 -1.5237144 4.49987521
C  2.3700247 -0.80767286 -2.15336891
H  3.0183773 -1.40112229 -1.50397125
H  1.39822025 -1.29479202 -2.26168755
C  -0.14394815 0.38178152 -0.27839091
C  -0.79055186 0.21939728 0.96211882
C  -0.88420618 0.32788728 -1.4800384
C  -2.15552321 0.00660802 1.0027892
H  -0.20611419 0.27390183 1.87540195
C  -2.23974853 0.11804502 -1.43574813
H  -0.4039992 0.45053612 -2.44563575
C  -2.89190881 -0.04643791 -0.19426919
H  -2.64057177 -0.11450824 1.96282229
H  -2.83244115 0.07450045 -2.34180989
O  -4.20160555 -0.24633196 -0.26397074
C  -4.95972363 -0.42960486 0.93209883
H  -4.90252243 0.46030203 1.56594786
H  -5.98563017 -0.57986219 0.60331947
H  -4.61400223 -1.3134377 1.47629353
F  2.94752012 -0.70026474 -3.39969888
