program: Gaussian 09
title: opt freq
version: EM64L-G09RevD.01
method: RwB97XD
basis: 6-31+G(d,p)
operation: Freq
keyword: #P
keyword: Geom=AllCheck
keyword: Guess=TCheck
keyword: SCRF=Check
keyword: GenChk
keyword: RwB97XD/6-31+G(d,p)
keyword: Freq
converged: YES YES YES YES
title: Mulliken charges:
elementType: C N C H H H O H H C H C H H
charge: -0.014445 0.075385 -0.379886 0.263306 0.277751 0.322900 -0.734122 0.398889 0.397676 0.066188 0.221115 -0.310859 0.191184 0.224918
chargesum: 1.00000
title: Mulliken charges with hydrogens summed into heavy atoms:
elementType: C N C O C C
charge: 0.308455 0.075385 0.161170 0.062443 0.287303 0.105242
polarizability: 1.08114593e+02 8.80018921e+00 4.94847549e+01 4.92737663e+00 3.44350461e+00 4.73445000e+01
1716.lowfreq: -223.6822 -12.7605 -2.1144 -0.0005 0.0010 0.0010 23.1880 61.2958 88.5682
frequency: -223.6706 60.9187 87.1378 123.3947 151.1157 186.6785 197.5660 295.3176 336.1287 361.9253 389.1697 428.5421 665.2546 816.9638 853.6821 936.6597 981.6095 1019.0119 1062.3588 1126.7424 1202.7734 1248.9293 1338.6801 1447.2267 1483.1781 1647.2123 1697.7992 2050.7216 3129.2229 3181.0832 3216.3252 3238.2718 3287.5371 3345.4419 3867.7674 3980.1976
redmass: 5.2668 4.4010 2.9330 2.0495 2.7444 3.5656 1.7589 2.2541 1.6473 2.1130 1.3753 1.8703 1.5232 1.1602 1.3445 1.2143 1.8107 1.1535 1.3656 1.2861 1.6056 1.1523 1.2503 1.1420 1.2224 1.0832 3.8614 6.0729 1.0635 1.0635 1.1075 1.0958 1.1167 1.1513 1.0448 1.0830
irintensity: 199.9761 0.5894 5.8948 0.1736 19.6861 37.1080 34.7448 14.5248 30.7270 84.0619 223.2942 15.6694 131.5542 62.9193 19.1356 10.3070 39.5733 35.4696 31.5681 3.6770 8.0286 76.5340 4.0627 29.7526 43.5378 81.0632 78.2470 122.0102 12.5096 1.0391 19.0403 7.1131 2.1082 109.0095 135.8314 125.7785
temp: 298.150 k
press: 1.00000 atm
elementType: 6 7 6 1 1 1 8 1 1 6 1 6 1 1
symmnumber: 1
zpe: 295732.1 jmol-1
zpe.correction: 0.112638 hartree
zpe.thermalcorrener: 0.121769 hartree
zpe.thermalcorrenthalpy: 0.122713 hartree
zpe.thermalcorrgfe: 0.079019 hartree
zpe.sumelectzpe: -286.624439 hartree
zpe.sumelectthermal: -286.615308 hartree
zpe.sumelectthermalent: -286.614364 hartree
zpe.sumelectthermalfe: -286.658059 hartree
dipole: -0.3825 -0.3419 -1.3325
dipole: 1.4279
quadrupole: -4.6777 -30.3345 -29.2759
quadrupole: -0.0498 1.4967 -1.3194
quadrupole: 16.7516 -8.9051 -7.8466 -0.0498 1.4967 -1.3194
hfenergy: -286.7370777 hartree
pointgroup: C01 [X(C4H8N1O1)]
dipole: -0.1762387 -0.0723958 -0.519793 debye
dipolederiv: -1.1134567 -0.11658 -0.1839408 0.017253 0.0471878 -0.0939941 -0.4744862 -0.1302107 0.0344994 1.0781843 -0.2230682 0.1866956 0.2241985 0.0167508 0.0590791 0.7108274 0.0480223 0.0318094 1.797264 0.2457847 -0.028512 -0.2703082 0.2708145 -0.030242 -0.6312198 -0.0594274 0.0247717 -0.1191108 0.0474412 -0.0176273 0.0119268 0.1225425 -0.0182357 0.118827 -0.0125742 0.0714154 0.0045823 -0.0423003 0.0047569 0.0235012 0.1708996 0.0150523 0.0242479 0.0150936 0.1292194 0.2827446 0.0229048 0.0163491 -0.1045285 0.2783451 0.0576379 -0.0373109 0.059648 0.3002852 -1.0600926 0.0963177 0.0221801 0.2781754 -0.5940664 -0.0370434 0.052514 -0.0455951 -0.5477429 0.2937908 -0.0192872 -0.0099111 0.1009157 0.3069495 0.0204657 -0.0614938 0.0189025 0.3524712 0.2438967 0.0168476 -0.0301976 -0.0317982 0.3569664 0.0205811 0.0976628 0.0073636 0.3099163 -0.9789338 -0.0990524 -0.0191536 -0.3635974 -0.3853269 -0.053454 -0.1993885 -0.0316961 0.0627354 0.1005141 -0.0588906 -0.0161966 -0.0833319 0.1123698 0.0021351 -0.0113097 0.0152052 0.0450694 0.1959651 0.1937279 0.0358259 0.2710278 0.0549995 -0.0137308 0.3936294 0.0677173 0.1049838 0.0857885 -0.041673 0.0408557 0.0326328 0.1247502 0.0527819 0.0303392 0.0245782 0.0003674 0.1888635 -0.0221722 -0.0011244 -0.1060671 0.1168176 0.018967 -0.0128388 0.0229729 0.0801988 unknown
polarizability: 108.1145932|8.8001892|49.4847549|4.9273766|3.4435046|47.3445 unknown
InChI: InChI=1/4C.N.O.8H
charge 1 multiplicity 1
14 atoms
C  0.51761942 -0.00152297 -0.45840215
N  1.11395895 0.62029218 0.35651867
C  -0.9689659 0.90491217 -0.05894035
H  -1.16441702 1.2133719 -1.08962887
H  -0.72336151 1.76770485 0.5585054
H  0.4777586 -0.76459451 -1.22307583
O  3.16395358 -0.61441432 -0.09752448
H  3.89961456 -0.08769376 -0.42858028
H  3.51940522 -1.12118182 0.64072013
C  -1.85759925 -0.09071146 0.54914065
H  -1.80043889 -0.21540751 1.62603291
C  -2.75442013 -0.76157958 -0.18638081
H  -2.82456488 -0.64498302 -1.26555274
H  -3.47288998 -1.42543257 0.28294669
