program: Gaussian 09
title: opt freq
version: EM64L-G09RevD.01
method: RwB97XD
basis: 6-31+G(d,p)
operation: Freq
keyword: #P
keyword: Geom=AllCheck
keyword: Guess=TCheck
keyword: SCRF=Check
keyword: GenChk
keyword: RwB97XD/6-31+G(d,p)
keyword: Freq
converged: YES YES YES YES
title: Mulliken charges:
elementType: C N C H H H O H H O H H C H C H H
charge: 0.002802 0.072421 -0.379394 0.261235 0.278349 0.327084 -0.804779 0.456289 0.388433 -0.782915 0.398155 0.399618 0.072682 0.219075 -0.318649 0.187887 0.221706
chargesum: 1.00000
title: Mulliken charges with hydrogens summed into heavy atoms:
elementType: C N C O O C C
charge: 0.329886 0.072421 0.160191 0.039943 0.014858 0.291757 0.090944
polarizability: 1.11446477e+02 1.22210522e+01 5.79766056e+01 -5.06261316e+00 -4.75449161e+00 5.66546344e+01
1716.lowfreq: -279.1048 -19.8059 -9.5646 -0.0009 0.0004 0.0005 8.1605 23.0722 25.7294
frequency: -279.1038 21.9460 25.5409 57.3490 99.6620 120.6499 137.4353 161.1613 189.1881 238.6413 258.6674 284.2226 307.3992 330.4216 352.0621 427.6892 465.3827 662.8666 795.5938 812.0822 843.0054 922.2640 981.3547 1028.6403 1055.4682 1119.7097 1199.9236 1232.8510 1343.6757 1448.9226 1485.7364 1641.2456 1674.0751 1705.7883 2070.3265 3131.0403 3182.2196 3219.7647 3239.4470 3287.3657 3350.1371 3607.6100 3893.9787 3950.6681 4008.0065
redmass: 6.3898 3.9445 5.1558 4.8913 2.7667 1.0892 3.9614 3.7840 4.5782 3.0612 1.4020 1.0999 3.5045 1.1729 3.2855 1.8983 1.0736 1.4804 1.1297 1.0636 1.3281 1.2465 1.8965 1.1368 1.3575 1.2533 1.6280 1.1644 1.2495 1.1357 1.2302 1.0852 1.0774 3.8175 5.9125 1.0650 1.0632 1.1053 1.0960 1.1170 1.1568 1.0599 1.0444 1.0694 1.0837
irintensity: 127.6428 0.7780 1.5897 2.0841 11.9488 25.6312 6.9836 54.2207 6.4333 24.7888 271.7109 31.7830 18.6978 81.7157 53.2352 7.1251 86.9740 127.2123 64.2958 148.3703 24.0465 8.5910 30.2637 31.5371 36.2631 4.0517 6.2522 75.1769 4.2700 21.0624 47.1703 145.4813 21.5769 60.9077 100.0802 12.7412 1.1313 18.6111 7.0821 1.5379 111.4647 1089.7599 35.4635 118.3182 129.3184
temp: 298.150 k
press: 1.00000 atm
elementType: 6 7 6 1 1 1 8 1 1 8 1 1 6 1 6 1 1
symmnumber: 1
zpe: 361099.9 jmol-1
zpe.correction: 0.137536 hartree
zpe.thermalcorrener: 0.149959 hartree
zpe.thermalcorrenthalpy: 0.150903 hartree
zpe.thermalcorrgfe: 0.097546 hartree
zpe.sumelectzpe: -363.029117 hartree
zpe.sumelectthermal: -363.016695 hartree
zpe.sumelectthermalent: -363.015750 hartree
zpe.sumelectthermalfe: -363.069107 hartree
dipole: -1.3861 -1.5186 -0.4692
dipole: 2.1089
quadrupole: 13.8545 -35.2773 -35.3288
quadrupole: 0.5262 -2.1256 0.2683
quadrupole: 32.7717 -16.3601 -16.4116 0.5262 -2.1256 0.2683
hfenergy: -363.1666531 hartree
pointgroup: C01 [X(C4H10N1O2)]
dipole: -0.5216653 -0.6413226 -0.1064773 debye
dipolederiv: -0.767076 -0.3114994 0.0608447 -0.6293304 -0.1061277 0.1262465 -0.0474405 0.0801473 0.0679824 0.6792101 0.236452 0.2713167 0.7667491 0.1883775 0.0325617 -0.1528 -0.0958781 0.025652 1.7529457 0.3003532 -0.1856043 -0.2367166 -0.0154517 -0.0056019 0.2986074 0.0786148 0.251917 -0.1297734 -0.0493378 -0.06093 0.0728332 0.0779642 0.0022839 -0.0234967 0.013511 0.118647 0.0009884 -0.0187173 0.0320452 -0.0018551 0.1338179 -0.0081837 -0.0193457 -0.0211221 0.1711287 0.2862074 0.0078915 -0.0083378 -0.0598903 0.2892085 -0.073088 0.1203551 -0.0374483 0.2875053 -1.2600495 0.0539244 0.0178708 0.122023 -0.5900113 0.0097663 -0.1400888 -0.0353654 -0.6988266 0.7977805 -0.1491768 -0.1898951 -0.266091 0.3548602 0.0694081 -0.4023531 0.0626663 0.378873 0.2341601 -0.0470115 -0.0444748 0.0755025 0.3112783 -0.0171431 0.0070536 -0.0304305 0.3321677 -0.7280407 0.0080852 0.018935 0.0818727 -0.6324714 -0.1006717 0.1020618 -0.0992583 -0.6505869 0.277053 0.0101315 0.0522301 0.0122203 0.3407208 0.0254538 0.0360863 0.0275602 0.3402856 0.2661915 0.0476427 0.0187121 0.020767 0.3491057 0.0239539 0.023031 0.0199527 0.3434987 -0.8386058 -0.1925995 0.047441 -0.3744173 -0.0104424 0.0263408 0.2533146 0.1077193 -0.3500109 0.0981848 -0.0059922 0.0592108 0.0013138 0.0387675 -0.0038059 0.0849396 0.0136614 0.1175393 0.0907342 0.0332173 -0.1670103 0.3611485 0.1770257 -0.0735718 -0.2334016 -0.0306111 0.0206918 0.0702636 0.0581914 0.0441852 0.0437198 0.0116935 -0.0147113 -0.0168221 -0.0543511 0.1226893 0.1698259 0.0184454 0.0334607 0.0101508 0.0816846 -0.0192375 0.1102992 0.0006318 0.1208464 unknown
polarizability: 111.4464766|12.2210522|57.9766056|-5.0626132|-4.7544916|56.6546344 unknown
InChI: InChI=1/4C.N.2O.10H
charge 1 multiplicity 1
17 atoms
C  -0.32755647 -0.13436384 0.00544037
N  0.07265126 0.80079664 -0.59935321
C  -1.82057749 -0.0200466 -0.98670769
H  -1.78036688 -1.06526798 -1.30522322
H  -1.6750036 0.64078053 -1.8399493
H  -0.24011923 -0.90418274 0.75886047
O  2.04553276 0.42107725 0.92935053
H  2.85539572 0.1176713 0.47092441
H  2.329926 1.10321069 1.54480316
O  4.25836251 -0.51658809 -0.41295293
H  4.75236477 -0.0225725 -1.07348301
H  4.86877711 -1.15541855 -0.03375402
C  -2.864318 0.37934524 -0.03530652
H  -3.03375699 1.4434138 0.09682944
C  -3.62321263 -0.53249429 0.58541706
H  -3.46452618 -1.60115614 0.4600894
H  -4.45211943 -0.22953187 1.21635934
