program: Gaussian 09
title: 000052852
version: EM64L-G09RevD.01
frameworkgroup: C1[X(C14H30O4P2S2)]
method: RPBEPBE
basis: SDD
operation: Freq
keyword: #p
keyword: freq=noraman
keyword: PBEPBE/SDD
title: #p freq=noraman PBEPBE/SDD
converged: YES YES NO NO
title: Mulliken charges:
elementType: S S P P O O O O C C C C C C C C C C C C C C H H H H H H H H H H H H H H H H H H H H H H H H H H H H H H
charge: -0.029975 0.018691 1.277049 0.422454 -0.548191 -0.511942 -0.504561 -0.619807 -0.381288 -0.362897 -0.367018 -0.297648 -0.236696 -0.329475 -0.356924 -0.686929 -0.349532 -0.347391 -0.593751 -0.700123 -0.685990 -0.683768 0.304005 0.244374 0.207288 0.202306 0.258838 0.244701 0.207877 0.211242 0.226871 0.190294 0.229961 0.209052 0.204151 0.205541 0.223719 0.215998 0.189213 0.205270 0.197455 0.193593 0.283787 0.277959 0.379538 0.277854 0.217702 0.218427 0.208288 0.210941 0.216678 0.212791
chargesum: 0.00000
title: Mulliken charges with hydrogens summed into heavy atoms:
elementType: S S P P O O O O C C C C C C C C C C C C C C
charge: -0.029975 0.018691 1.277049 0.422454 -0.548191 -0.511942 -0.504561 -0.619807 -0.077283 0.088764 0.094126 0.154930 0.201418 0.090780 0.056280 -0.041671 0.044950 0.043657 -0.032006 -0.042731 -0.041573 -0.043359
polarizability: 2.58168820e+02 1.47471736e+01 2.49470665e+02 -1.47985150e+00 -6.45357752e+00 2.45218531e+02
1716.lowfreq: -14.7827 -13.2140 -11.0504 -5.4579 -0.0015 -0.0014 -0.0013 3.5868 14.9095
frequency: -13.0351 -12.3816 12.8245 18.6222 24.6606 29.5790 32.6611 41.7388 55.8910 67.8915 74.5107 91.2865 95.5886 98.3588 111.1089 116.5935 118.4568 128.1678 151.7406 164.4337 168.5380 202.1779 205.0670 216.3501 223.7506 230.8722 237.9205 256.3594 265.7244 276.5950 310.8891 313.7680 336.1505 348.1904 361.5850 383.7540 398.4165 402.3763 425.5824 429.5563 434.4632 451.8033 487.6297 591.1375 592.8543 609.3073 620.0467 667.7991 704.5960 739.8436 742.2801 775.3940 794.8922 798.8592 850.6416 866.4328 896.4883 897.2235 899.0363 919.0169 924.4971 932.5263 937.4744 946.5777 949.2098 1000.5266 1025.0939 1030.0453 1032.3619 1038.9970 1066.0543 1074.2650 1080.6883 1110.3205 1114.1404 1116.7566 1121.2278 1126.3688 1144.7968 1148.2985 1155.8277 1196.7912 1210.2919 1223.0333 1254.3452 1263.1017 1267.1001 1270.7444 1271.1428 1286.1071 1286.3830 1287.0162 1293.3789 1298.0400 1326.1912 1337.4862 1343.9336 1344.3824 1358.6329 1364.5484 1365.3967 1387.3711 1389.5726 1393.4132 1425.7820 1448.4973 1457.9454 1458.6187 1465.4831 1470.6848 1472.6373 1474.3108 1475.6965 1476.6168 1478.1316 1480.8110 1482.1522 1485.7999 1488.0191 1490.0231 2968.0844 2969.2325 2971.9067 2975.0168 2975.2584 2975.8173 2980.8140 2987.8147 2989.2307 2992.0280 2999.2850 3000.7580 3006.3594 3012.3140 3012.6324 3027.3797 3040.2760 3040.5146 3044.4949 3046.3561 3070.7944 3071.8073 3072.6278 3074.7029 3076.4303 3076.9229 3079.8143 3080.0847 3087.2894 3113.1560
redmass: 3.3938 2.6112 3.4775 5.9291 4.0444 3.0047 4.1063 2.5962 2.1502 3.7005 3.2513 2.4155 2.6135 3.6003 3.5699 3.2243 3.0977 3.8031 4.4855 2.5644 3.3519 3.1883 2.9817 6.1067 2.1012 1.1496 1.2294 3.1107 4.2016 4.8855 4.3809 6.2480 4.5634 4.2048 9.1698 5.6901 3.1678 11.0208 3.7756 3.6969 4.1909 3.9596 6.0294 5.4836 5.5382 4.1417 8.4018 6.1075 4.1548 1.0722 1.0725 1.3612 1.1413 1.1577 1.5127 2.6729 1.6384 1.9046 1.6019 5.6276 4.1186 1.3039 1.2062 4.0543 1.5359 2.2127 2.3955 9.7621 3.8523 3.9633 1.9804 2.4302 2.2830 1.9456 2.4344 2.5002 2.1888 1.0631 1.4637 1.3274 1.6197 1.3892 1.3628 1.3090 1.2297 1.2105 1.2459 1.2145 1.2163 1.1497 1.1199 1.1352 1.0826 1.1898 1.1492 1.3458 1.3830 1.4062 1.3441 1.3405 1.4248 1.2128 1.2117 1.2151 1.0928 1.0876 1.0820 1.0840 1.0793 1.0696 1.0668 1.0443 1.0428 1.0546 1.0515 1.0661 1.0646 1.0561 1.0849 1.0887 1.0587 1.0582 1.0624 1.0368 1.0378 1.0370 1.0589 1.0809 1.0601 1.0631 1.0582 1.0576 1.0570 1.0998 1.0997 1.0579 1.0983 1.1032 1.1028 1.1002 1.1025 1.1021 1.1012 1.0995 1.1002 1.0986 1.1062 1.1065 1.1086 1.1075
irintensity: 0.3546 0.1023 0.6831 0.1077 0.5884 0.0899 0.9205 0.3528 0.1900 0.2634 0.3803 0.0703 0.1232 4.8057 2.3592 0.6377 1.0383 0.9777 2.1465 0.4431 1.4001 0.8503 14.0636 12.6637 2.7661 0.1338 1.4321 5.7807 5.4845 5.8657 14.3206 4.5537 5.3171 10.2821 9.7241 20.4554 9.0464 29.2945 3.6951 3.0489 2.9291 18.9155 40.1980 10.6284 22.4252 3.5432 98.8537 119.8561 105.8896 8.6791 6.6548 6.1732 0.9978 1.1092 12.4244 3.1300 33.2816 43.4866 1.7649 154.4510 104.0478 13.4378 4.6502 159.4992 11.6872 40.9316 3.1330 147.2154 37.2281 20.2215 1.4324 7.7626 4.4139 9.6950 4.3143 5.2797 4.9926 1.0443 1.3075 1.5003 1.8625 1.7258 0.4647 0.0413 5.1923 7.1244 2.2794 1.4994 1.9877 4.4620 5.7671 1.5395 0.8819 7.5178 6.5895 1.9247 0.8097 0.3338 0.0409 12.6251 12.1569 7.7325 9.1733 15.3608 12.0710 10.0940 6.3775 3.5624 1.3160 0.1879 0.4156 2.8307 11.3220 7.1364 9.1985 9.2725 22.6185 17.3915 19.9218 21.7101 21.4705 24.1088 19.3164 38.7392 23.6032 29.9331 25.4597 7.7184 16.6880 35.5338 51.1018 45.2889 18.8195 6.0658 3.8955 22.3540 8.6057 8.8137 6.0827 8.8753 17.0019 24.4057 50.7208 48.3700 58.1783 55.0753 82.7963 78.7581 16.6632 2.5618
temp: 298.150 k
press: 1.00000 atm
elementType: 16 16 15 15 8 8 8 8 6 6 6 6 6 6 6 6 6 6 6 6 6 6 1 1 1 1 1 1 1 1 1 1 1 1 1 1 1 1 1 1 1 1 1 1 1 1 1 1 1 1 1 1
symmnumber: 1
zpe: 1125759.9 jmol-1
zpe.correction: 0.428779 hartree
zpe.thermalcorrener: 0.457649 hartree
zpe.thermalcorrenthalpy: 0.458593 hartree
zpe.thermalcorrgfe: 0.364834 hartree
zpe.sumelectzpe: -2329.161855 hartree
zpe.sumelectthermal: -2329.132985 hartree
zpe.sumelectthermalent: -2329.132041 hartree
zpe.sumelectthermalfe: -2329.225801 hartree
dipole: -0.3353 -2.5378 2.3718
dipole: 3.4898
quadrupole: -165.1187 -180.4775 -151.1162
quadrupole: 7.2142 -5.2855 -0.3001
quadrupole: 0.4521 -14.9067 14.4546 7.2142 -5.2855 -0.3001
hfenergy: -2329.5906342 hartree
pointgroup: C01 [X(C14H30O4P2S2)]
dipole: -0.8457451 -0.9112949 0.5825174 debye
polarizability: 244.1641144|6.1066095|267.1285415|-3.3087654|7.662992|241.5653594 unknown
InChI: InChI=1S/C12H26O4P2.C2H4S2/c1-4-7-10-14-18(13,15-11-8-5-2)12(16-17)9-6-3;3-1-2-4/h12H,4-11H2,1-3H3;1-2H2
charge 0 multiplicity 1
52 atoms
S  -0.976168 1.773519 4.049437
S  -0.213339 -1.527364 3.829783
P  0.237179 1.125145 -0.496133
P  0.930915 0.455875 3.752695
O  -1.215621 0.284877 0.014305
O  1.326244 -0.088839 -1.078124
O  1.103153 0.505043 1.95735
O  -0.02456 2.226911 -1.616683
C  0.912145 1.731364 1.182022
C  2.221238 2.525185 1.027654
C  2.055184 3.918673 0.367464
C  -2.314192 0.19528 -0.996329
C  1.472791 -1.421109 -0.415064
C  -2.0828 -0.939409 -2.003214
C  1.99074 -2.387493 -1.481363
C  1.23717 4.918554 1.215819
C  -3.260379 -1.071104 -2.999069
C  2.245246 -3.799456 -0.89991
C  -2.286261 0.387981 3.886592
C  -1.78669 -0.788221 3.052783
C  -3.035174 -2.201561 -4.026345
C  2.767791 -4.787468 -1.965088
H  0.098462 2.342261 1.62327
H  2.946185 1.915068 0.455702
H  2.640776 2.650213 2.047544
H  3.069267 4.330795 0.201782
H  1.59066 3.805518 -0.629979
H  -2.403064 1.170777 -1.512389
H  -3.216754 0.018551 -0.384897
H  0.494737 -1.742524 -0.009726
H  2.181196 -1.312139 0.425321
H  -1.946408 -1.893747 -1.456717
H  -1.147628 -0.744451 -2.563874
H  2.927847 -1.982384 -1.909337
H  1.257715 -2.444142 -2.309392
H  1.676787 5.043906 2.223936
H  1.214938 5.911059 0.730967
H  0.187466 4.595381 1.341766
H  -4.200758 -1.258699 -2.441315
H  -3.397052 -0.109622 -3.533662
H  2.976673 -3.729954 -0.06947
H  1.30756 -4.192983 -0.457088
H  -2.551314 0.082453 4.910999
H  -3.147075 0.874862 3.395012
H  -1.550952 -0.495483 2.015159
H  -2.520429 -1.614987 3.060664
H  -2.122825 -2.015786 -4.622944
H  -3.886455 -2.283695 -4.726357
H  -2.915142 -3.179008 -3.522289
H  2.041186 -4.900781 -2.791452
H  2.947774 -5.788492 -1.532182
H  3.719213 -4.430854 -2.402134
