program: Gaussian 09
title: ts
version: EM64L-G09RevD.01
method: RwB97XD
basis: 6-31+G(d,p)
operation: Freq
keyword: #P
keyword: Geom=AllCheck
keyword: Guess=TCheck
keyword: SCRF=Check
keyword: GenChk
keyword: RwB97XD/6-31+G(d,p)
keyword: Freq
converged: YES YES YES YES
title: Mulliken charges:
elementType: C N C H H O H H C H H C C H H H C H H H
charge: -0.210615 0.082929 -0.205955 0.251179 0.262138 -0.708545 0.408876 0.407277 -0.185238 0.224756 0.258775 -0.052740 -0.266500 0.195928 0.201956 0.168205 -0.462835 0.214784 0.187241 0.228383
chargesum: 1.00000
title: Mulliken charges with hydrogens summed into heavy atoms:
elementType: C N C O C C C C
charge: -0.210615 0.082929 0.307362 0.107608 0.298293 0.143188 0.103662 0.167573
polarizability: 8.37252224e+01 7.71157967e+00 1.12250802e+02 -1.28632583e+00 1.73789857e+00 6.25005497e+01
1716.lowfreq: -186.4634 -15.4206 -0.0005 -0.0004 -0.0002 7.9980 13.7879 36.3338 78.8780
frequency: -186.4627 33.0722 78.8663 86.6397 127.5613 144.9928 176.8262 207.9567 242.9543 264.3788 289.8148 406.5655 426.5809 433.2146 475.0629 532.4519 577.3350 673.2475 767.7118 888.8673 917.6438 958.8542 961.8490 1028.4093 1036.5720 1069.5222 1090.9468 1139.9636 1251.2139 1270.7755 1305.6188 1323.5615 1339.0338 1427.3294 1453.2877 1459.9581 1472.7856 1496.9561 1501.4169 1647.3172 1735.5297 2037.2999 3083.4256 3090.2572 3092.2375 3157.6971 3159.5082 3169.6289 3185.2898 3193.1398 3215.1723 3286.1664 3858.4243 3971.1176
redmass: 5.0150 2.8207 3.2132 2.8715 3.6377 1.6536 1.1272 2.1497 2.3123 2.1530 2.5540 2.0080 1.8588 1.2451 1.5766 2.6021 4.6678 2.0503 1.2379 2.5565 1.6504 2.2173 1.6535 1.2727 1.1567 1.7610 1.6408 1.7822 1.2209 1.2087 1.2199 1.2697 1.2705 1.1782 1.1118 1.1116 1.1321 1.0477 1.0538 1.0826 4.5264 11.4380 1.0372 1.0637 1.0591 1.1055 1.1020 1.1007 1.0628 1.1054 1.0942 1.1166 1.0446 1.0833
irintensity: 155.0875 0.1102 0.1239 0.4679 1.3687 6.2120 36.0816 16.5045 4.2073 0.5131 11.9514 72.1712 11.8199 57.7682 156.4536 8.8871 15.3596 5.5395 10.4174 27.3830 18.9937 3.0369 7.6323 55.6614 12.3599 2.6659 23.4737 5.1890 5.3677 22.2867 9.2497 12.4461 0.2469 13.0190 13.0097 32.2722 22.7220 13.6233 5.4219 96.9438 0.7099 74.8507 3.3134 13.1421 2.4249 4.8987 19.4437 4.2431 2.1190 0.9077 0.9037 0.6654 163.9913 134.9254
temp: 298.150 k
press: 1.00000 atm
elementType: 6 7 6 1 1 8 1 1 6 1 1 6 6 1 1 1 6 1 1 1
symmnumber: 1
zpe: 449927.5 jmol-1
zpe.correction: 0.171368 hartree
zpe.thermalcorrener: 0.182610 hartree
zpe.thermalcorrenthalpy: 0.183554 hartree
zpe.thermalcorrgfe: 0.134265 hartree
zpe.sumelectzpe: -365.207924 hartree
zpe.sumelectthermal: -365.196683 hartree
zpe.sumelectthermalent: -365.195739 hartree
zpe.sumelectthermalfe: -365.245027 hartree
dipole: -0.9736 1.4613 0.0898
dipole: 1.7582
quadrupole: -36.3333 -21.5307 -42.1228
quadrupole: 4.5586 1.0905 -0.3166
quadrupole: -3.0044 11.7983 -8.7939 4.5586 1.0905 -0.3166
hfenergy: -365.3792925 hartree
pointgroup: C01 [X(C6H12N1O1)]
dipole: -0.4042039 0.5523721 0.0603064 debye
dipolederiv: -0.0480801 -0.2212342 -0.0564242 -0.422032 -0.669974 0.0326272 0.0113865 0.1165664 0.1432728 0.1814271 0.5195417 -0.0868097 0.9352701 1.2601304 -0.1652533 -0.0203275 -0.1184874 -0.0827106 0.5305808 0.586954 0.0437235 0.1533491 0.0611481 0.0712828 -0.0258684 -0.0902934 0.047009 -0.0380816 -0.2174697 -0.0468155 -0.1354963 -0.0026078 0.024085 -0.108593 -0.0303898 0.1064967 0.1292028 0.0183422 -0.0042798 -0.029799 0.1015963 -0.0342188 -0.051759 -0.0532045 0.1303215 -0.7720826 -0.4666027 0.0653056 -0.3008002 -0.932541 0.0631452 0.1067961 0.1682177 -0.4828623 0.2674991 -0.0688177 -0.0125499 0.0195152 0.3159047 -0.0038609 -0.0627379 -0.0892459 0.3467556 0.3506264 0.017316 0.0125598 -0.0011114 0.2984733 -0.0073827 0.0731031 0.1037282 0.2918349 0.2397479 -0.1805941 -0.0019752 -0.1537442 0.3148975 0.0422218 -0.0306582 -0.0051081 0.0646176 0.029508 0.0351056 -0.0594494 0.0086262 0.0562561 -0.0487005 -0.0422873 0.0040362 0.0683064 0.0618066 0.0742914 0.0135991 0.0419797 0.0008839 -0.0011772 -0.0028307 -0.0106486 0.1052685 -0.1573543 0.0126165 0.1792155 0.0540691 -0.0576535 -0.0463275 0.2467353 -0.1354419 -0.0062926 -0.1816015 0.0288808 0.1200022 -0.0414952 0.0826263 0.0313834 0.0746956 0.0699688 0.0322077 0.1287423 -0.020585 -0.0664909 0.0029207 0.0020928 -0.0237728 -0.0885545 0.0136438 0.0247724 0.1357996 0.0163759 -0.0535279 0.023016 0.0508952 0.0159123 -0.0533971 0.0371665 0.0689011 0.1035653 -0.0204432 -0.0867382 0.0000477 0.0967793 0.0203482 -0.0849846 -0.0225015 -0.0059507 -0.1704727 -0.1788739 -0.0366208 -0.1693881 -0.0969379 0.0111297 0.1226071 0.1269945 0.0114962 0.1325376 0.0241843 -0.0121701 0.0471167 0.0146868 0.0560732 -0.0300125 0.0155222 0.0469954 0.0101332 0.0774206 0.0620544 0.0365218 0.0308254 -0.0441984 0.0074349 -0.0479106 0.0337836 0.066496 -0.0364085 0.0273915 -0.0685659 0.072518 0.0066833 -0.040748 -0.0526126 0.0557768 unknown
polarizability: 83.7252224|7.7115797|112.2508018|-1.2863258|1.7378986|62.5005497 unknown
InChI: InChI=1/6C.N.O.12H
charge 1 multiplicity 1
20 atoms
C  -0.191647 0.49178953 0.05936589
N  -0.61935897 1.55828003 0.42000749
C  -1.545417 -0.25690644 0.62812393
H  -1.04023604 -0.96474915 1.29643647
H  -2.17954941 0.38880176 1.23992189
O  1.09778045 2.90995865 -0.1904659
H  0.77057512 3.57351703 -0.80876996
H  1.38060346 3.39627518 0.59264392
C  0.94006219 -0.25026765 -0.58042944
H  0.56890991 -0.63871581 -1.53431061
H  1.69935336 0.51147047 -0.78016642
C  1.44129552 -1.35713044 0.31022305
C  1.31331093 -2.6478532 0.009564
H  1.95088046 -1.04916579 1.22013194
H  1.71367627 -3.41442134 0.66413749
H  0.832592 -2.98404444 -0.9059048
C  -2.28434356 -0.85094937 -0.5513998
H  -2.67340391 -0.07519141 -1.21437226
H  -1.66575251 -1.5456286 -1.12189286
H  -3.13801661 -1.40570942 -0.15012504
