program: Gaussian 09
title: ts
version: EM64L-G09RevD.01
method: RwB97XD
basis: 6-31+G(d,p)
operation: Freq
keyword: #P
keyword: Geom=AllCheck
keyword: Guess=TCheck
keyword: SCRF=Check
keyword: GenChk
keyword: RwB97XD/6-31+G(d,p)
keyword: Freq
converged: YES YES YES YES
title: Mulliken charges:
elementType: C N C H H O H H O H H C H H H C H H H
charge: 0.200719 0.056893 -0.276587 0.250286 0.275783 -0.812706 0.457619 0.392950 -0.781804 0.398117 0.399547 -0.474551 0.233163 0.234993 0.285436 -0.482329 0.219953 0.191105 0.231412
chargesum: 1.00000
title: Mulliken charges with hydrogens summed into heavy atoms:
elementType: C N C O O C C
charge: 0.200719 0.056893 0.249483 0.037863 0.015861 0.279040 0.160142
polarizability: 8.55446308e+01 3.78176099e+00 5.88827236e+01 8.27692628e+00 -3.34540572e+00 6.26884017e+01
1716.lowfreq: -291.2296 -5.6975 0.0009 0.0010 0.0010 10.3831 12.3786 26.7612 33.2560
frequency: -291.2246 26.2379 32.4110 77.5356 107.5912 138.4176 162.1070 165.4082 215.7100 250.4415 264.7708 278.7074 285.2087 300.7814 328.5104 382.5991 442.6844 485.1681 499.0729 747.9681 812.2405 909.3726 955.6895 1004.1591 1066.1046 1090.1424 1110.9298 1255.7591 1273.8843 1407.2198 1430.5076 1456.2823 1465.0878 1478.2110 1498.2221 1505.1395 1640.6097 1673.4565 2150.8626 3083.0218 3084.1669 3118.2694 3167.4759 3178.3875 3185.2881 3197.8670 3201.1259 3605.0696 3892.1710 3956.8133 4005.5901
redmass: 5.9613 3.8685 4.2003 3.1287 2.8609 1.0386 1.1569 2.8593 3.0202 1.4107 3.2383 1.1104 1.3681 2.2252 1.2834 2.3250 3.3926 1.2100 3.2315 1.1967 1.0556 4.1787 1.5995 1.2112 1.5607 1.9829 1.4951 1.1922 1.2458 1.2217 1.1723 1.1039 1.0428 1.0483 1.0421 1.0550 1.0849 1.0770 11.8125 1.0364 1.0326 1.0651 1.1003 1.1034 1.1043 1.1052 1.1060 1.0600 1.0445 1.0694 1.0837
irintensity: 120.7935 0.8952 4.2266 2.0515 2.0332 28.4385 0.3794 14.0745 8.6106 2.3530 9.6228 123.1846 176.7930 2.6086 95.5989 24.8372 2.6983 59.5200 20.0377 4.6027 139.5179 17.5012 6.8278 1.8448 3.6630 1.2875 21.9785 1.0552 46.5259 16.1344 15.8908 11.3755 18.0300 43.7732 15.9165 5.0647 148.6722 23.0456 62.1066 5.3303 4.9761 12.1425 6.1088 18.4248 3.6221 1.3764 14.2461 923.7764 34.6104 122.6138 127.8791
temp: 298.150 k
press: 1.00000 atm
elementType: 6 7 6 1 1 8 1 1 8 1 1 6 1 1 1 6 1 1 1
symmnumber: 1
zpe: 424976.1 jmol-1
zpe.correction: 0.161865 hartree
zpe.thermalcorrener: 0.174546 hartree
zpe.thermalcorrenthalpy: 0.175490 hartree
zpe.thermalcorrgfe: 0.122522 hartree
zpe.sumelectzpe: -364.273783 hartree
zpe.sumelectthermal: -364.261102 hartree
zpe.sumelectthermalent: -364.260158 hartree
zpe.sumelectthermalfe: -364.313126 hartree
dipole: -1.7094 -0.6334 -0.0396
dipole: 1.8234
quadrupole: 0.5939 -35.8871 -32.0631
quadrupole: -1.5916 -4.2531 -0.6461
quadrupole: 23.0460 -13.4350 -9.6110 -1.5916 -4.2531 -0.6461
hfenergy: -364.4356478 hartree
pointgroup: C01 [X(C4H12N1O2)]
dipole: -0.6823969 -0.2346497 -0.0232663 debye
dipolederiv: -0.4918755 -0.2726195 -0.0484591 -0.2415198 0.2596478 -0.2518581 0.0221099 -0.1914867 0.3824181 1.1733077 0.1843666 0.1968471 0.4713851 -0.0640364 0.1569424 -0.0983577 0.0072174 -0.2294254 0.4475087 0.145672 0.2206991 -0.1167531 -0.0217219 0.1493448 0.5494506 0.2065686 0.2479489 -0.0865513 -0.0349077 -0.0655504 -0.0966512 0.1149042 -0.0597899 -0.1308199 -0.0519596 -0.0225405 0.1137166 -0.0125759 -0.0422452 -0.0767016 0.1252195 -0.0456813 -0.0082089 0.0010528 0.1248299 -1.1580214 0.0585657 -0.0114004 0.1653454 -0.5464412 -0.0384033 -0.0211504 -0.077137 -0.7198781 0.5814937 -0.1547343 -0.2050258 -0.272201 0.3693035 0.1345539 -0.4031459 0.1294607 0.472485 0.2408606 -0.0437508 -0.0059052 0.047379 0.2850561 0.0065136 0.0278428 0.0029443 0.3446891 -0.6682358 -0.0127479 0.0140232 0.0563664 -0.648424 -0.1093933 0.1018243 -0.1018457 -0.6392726 0.2999871 0.0234055 0.0593467 0.02349 0.3414292 0.0179679 0.0435176 0.0200226 0.3052112 0.2816853 0.0507812 0.0303495 0.0315676 0.3488256 0.0117968 0.0303475 0.0052923 0.3233596 -0.0003672 0.05691 -0.0859598 -0.0224089 -0.02121 0.0460526 -0.0177311 0.0574979 0.0031846 0.0625317 0.0405761 0.032625 0.060198 0.0911984 -0.0110393 0.0027543 0.0160005 0.1228148 0.1334125 -0.0231177 -0.0135142 -0.0123396 0.1067219 -0.013912 -0.0169973 -0.0423499 0.0434206 0.1415102 -0.0163148 0.0132261 -0.0114841 0.092108 0.0290445 0.0071535 0.0346984 0.1105867 -0.290485 -0.0459384 -0.1460079 0.0974342 0.0564631 0.0070823 -0.1032069 -0.0777654 -0.0559926 0.0556165 0.0071421 0.0886319 -0.0304733 0.0671662 -0.0100716 0.0628121 -0.0155767 0.07787 0.1098305 0.0178434 -0.0001186 -0.0251743 -0.0127667 0.0230859 0.0085256 0.0880189 0.0063902 0.0540752 0.0314445 -0.031562 -0.0474586 0.0565565 -0.0422359 -0.0567202 -0.0106534 0.1019005 unknown
polarizability: 85.5446308|3.781761|58.8827236|8.2769263|-3.3454057|62.6884017 unknown
InChI: InChI=1/4C.N.2O.12H
charge 1 multiplicity 1
19 atoms
C  -0.81342453 0.13299448 0.50762176
N  -0.31327894 0.98643508 -0.16171983
C  -2.21324048 0.58721285 -0.38948681
H  -2.83100384 0.78518641 0.49161974
H  -2.13674896 1.52118015 -0.94892339
O  1.840909 0.62380546 0.87602525
H  2.48427473 0.25899758 0.23516422
H  2.23827253 1.42507586 1.22898192
O  3.57502474 -0.5237155 -0.92586994
H  3.89313894 -0.11807256 -1.73755668
H  4.2606634 -1.13359063 -0.63799771
C  -0.78421 -0.92358165 1.525895
H  -1.56236508 -0.74771767 2.27143854
H  -0.94454594 -1.89322851 1.04928471
H  0.2108645 -0.88049338 1.97419895
C  -2.58057689 -0.59122305 -1.25769503
H  -1.84911096 -0.73747624 -2.05507903
H  -2.69917167 -1.51677324 -0.69228377
H  -3.54206422 -0.35578968 -1.72553435
