program: Gaussian 09
title: ts
version: EM64L-G09RevD.01
method: RwB97XD
basis: 6-31+G(d,p)
operation: Freq
keyword: #P
keyword: Geom=AllCheck
keyword: Guess=TCheck
keyword: SCRF=Check
keyword: GenChk
keyword: RwB97XD/6-31+G(d,p)
keyword: Freq
converged: YES YES YES YES
title: Mulliken charges:
elementType: C N C H H O H H C H H H C C C C H C H C H H O C H H H
charge: -1.043383 0.017259 -0.137764 0.210583 0.234817 -0.557183 0.426674 0.428916 -0.482215 0.196568 0.190298 0.206508 1.303301 -0.502622 -0.627644 0.036325 0.162892 0.732878 0.195493 -0.448288 0.200539 0.178961 -0.309607 -0.149432 0.169515 0.195642 0.170967
chargesum: 1.00000
title: Mulliken charges with hydrogens summed into heavy atoms:
elementType: C N C O C C C C C C C O C
charge: -1.043383 0.017259 0.307636 0.298407 0.111159 1.303301 -0.339730 -0.432151 0.236864 0.911840 -0.448288 -0.309607 0.386692
polarizability: 1.44301223e+02 6.71129014e-01 1.97131574e+02 -5.98040858e+00 3.33231375e+00 8.52060815e+01
1716.lowfreq: -97.0201 -13.5355 -5.6598 -0.0002 0.0004 0.0005 6.8763 59.3302 70.4971
frequency: -97.0178 59.1695 70.4853 111.2593 126.5258 148.6984 159.5723 163.6536 179.6440 228.9884 252.1880 285.3970 305.4837 335.8384 342.0935 403.1848 426.5248 503.7173 519.6796 535.5777 637.4399 646.7835 661.9872 664.8454 704.3381 734.0578 790.3505 832.2517 837.7701 863.9325 885.7404 982.8276 992.0581 1005.2590 1029.4263 1073.5620 1076.4619 1084.5417 1183.7321 1190.4541 1216.1461 1224.4214 1246.8114 1269.8639 1327.2535 1359.8290 1363.1238 1387.5718 1429.7339 1487.1638 1490.5062 1495.1963 1503.0694 1508.9750 1512.9801 1522.3898 1580.1089 1628.2263 1636.4924 1671.1311 1791.9031 3064.1873 3084.8739 3101.6012 3147.0567 3150.6946 3169.8208 3192.1344 3211.1554 3247.3606 3264.0088 3269.0416 3287.6268 3804.9140 3919.1518
redmass: 5.6026 3.6853 3.7421 3.0578 3.3456 2.0419 1.0816 1.7254 3.0465 2.0013 1.8314 3.3207 2.8971 3.8460 4.0382 4.5307 3.0490 3.9195 2.8367 3.4242 2.3672 4.4422 3.3110 1.4433 1.7231 4.0186 1.3916 2.7612 1.4906 1.8156 4.0869 1.8705 1.2926 1.3380 2.8249 1.5189 5.6402 1.9985 1.3656 1.2701 2.1421 1.3131 1.4322 1.3141 1.3212 4.4042 1.3897 3.5478 1.2018 1.0527 1.1043 2.6557 1.2057 1.0496 1.1187 1.0676 2.5856 6.0365 1.0811 5.3210 9.2301 1.0330 1.0362 1.0607 1.1035 1.1084 1.1029 1.1041 1.1034 1.0889 1.0964 1.0900 1.0942 1.0442 1.0843
irintensity: 169.5126 16.5960 29.0354 8.8765 0.3981 7.2893 39.0830 10.7177 10.6368 9.7593 13.2285 4.6214 14.3381 6.5801 16.4546 10.5143 2.1744 36.1579 9.6385 9.0198 24.5663 1.6189 32.3121 90.3194 107.8598 5.2375 8.0501 3.3565 1.6756 57.8036 43.9541 17.2894 0.5870 2.2240 2.4668 18.2779 65.9472 23.2118 3.4927 0.8988 250.0219 15.0670 46.7330 32.0122 20.9864 60.0163 2.1716 325.5423 7.7538 15.0246 28.2881 18.5302 13.7280 3.7566 43.8859 20.6592 162.5085 6.4837 133.0060 663.4032 177.7060 33.4593 2.9630 10.4614 1.1645 17.7434 1.6513 4.7832 4.5650 1.7661 0.2340 0.4778 2.9115 270.3998 167.6805
temp: 298.150 k
press: 1.00000 atm
elementType: 6 7 6 1 1 8 1 1 6 1 1 1 6 6 6 6 1 6 1 6 1 1 8 6 1 1 1
symmnumber: 1
zpe: 595752.4 jmol-1
zpe.correction: 0.226910 hartree
zpe.thermalcorrener: 0.240547 hartree
zpe.thermalcorrenthalpy: 0.241491 hartree
zpe.thermalcorrgfe: 0.187010 hartree
zpe.sumelectzpe: -593.964454 hartree
zpe.sumelectthermal: -593.950817 hartree
zpe.sumelectthermalent: -593.949873 hartree
zpe.sumelectthermalfe: -594.004355 hartree
dipole: 3.4232 4.7996 0.4340
dipole: 5.9113
quadrupole: -47.1118 -28.8125 -72.4992
quadrupole: 2.1539 0.0430 4.6818
quadrupole: 2.3627 20.6620 -23.0247 2.1539 0.0430 4.6818
hfenergy: -594.1913642 hartree
pointgroup: C01 [X(C10H14N1O2)]
dipole: 1.3014198 1.8346399 0.184068 debye
polarizability: 144.3012233|0.671129|197.131574|-5.9804086|3.3323137|85.2060815 unknown
InChI: InChI=1/10C.N.2O.14H
charge 1 multiplicity 1
27 atoms
C  0.09497877 2.01240603 0.19944575
N  0.95805378 2.91447034 0.19308992
C  -1.16180144 2.96755896 0.22878603
H  -1.68238374 2.67560164 1.14635745
H  -0.85376544 4.00767461 0.37191475
O  2.74427733 2.14618702 0.18621291
H  3.19966265 2.86005023 -0.28245494
H  3.02311778 2.20436639 1.11156505
C  -1.97372798 2.81575039 -1.05126555
H  -1.3879177 3.11893573 -1.92209749
H  -2.32258055 1.79292906 -1.20147368
H  -2.84310936 3.47490189 -0.98502014
C  -0.01765439 0.57125081 0.16835815
C  -1.20366137 -0.04728638 0.62048223
C  1.02136874 -0.231914 -0.33268527
C  -1.33158961 -1.41543276 0.59551392
H  -2.0279823 0.54136998 1.00788579
C  0.89030598 -1.60882314 -0.37877115
H  1.92882434 0.222409 -0.70706968
C  -0.28586978 -2.2149998 0.09368706
H  -2.23070324 -1.90265514 0.95400931
H  1.70067847 -2.20129931 -0.78405624
O  -0.50945325 -3.52529075 0.1037398
C  0.48317973 -4.41948611 -0.39636502
H  1.40902449 -4.33461587 0.18064903
H  0.06360967 -5.4153132 -0.2712634
H  0.67399313 -4.23125865 -1.45729682
