program: Gaussian 09
title: opt freq
version: EM64L-G09RevD.01
method: RwB97XD
basis: 6-31+G(d,p)
operation: Freq
keyword: #P
keyword: Geom=AllCheck
keyword: Guess=TCheck
keyword: SCRF=Check
keyword: GenChk
keyword: RwB97XD/6-31+G(d,p)
keyword: Freq
converged: YES YES YES YES
title: Mulliken charges:
elementType: C N C H H H O H H O H H C H H H
charge: 0.096280 0.075823 -0.270280 0.265385 0.285266 0.334175 -0.813925 0.457472 0.390754 -0.783926 0.399110 0.400806 -0.504407 0.203884 0.226786 0.236797
chargesum: 1.00000
title: Mulliken charges with hydrogens summed into heavy atoms:
elementType: C N C O O C
charge: 0.430455 0.075823 0.280370 0.034301 0.015990 0.163060
polarizability: 7.82087649e+01 2.72442628e+00 4.66608452e+01 5.34499784e+00 -1.11937706e+00 4.72975339e+01
1716.lowfreq: -273.0135 -0.8329 -0.0008 -0.0005 0.0011 10.0494 18.8155 30.4400 58.2935
frequency: -273.0072 30.1795 51.3276 75.9338 115.9655 137.2375 177.3127 227.1595 258.1374 273.7900 275.8726 290.5789 340.6669 358.3293 456.4254 481.2621 728.5502 820.7658 830.0375 864.0624 947.4396 1071.5391 1109.6285 1258.6792 1276.8651 1427.3291 1453.6888 1483.3296 1511.4713 1643.1163 1679.3806 2063.9043 3077.7257 3112.9086 3164.9756 3172.5500 3197.2838 3335.5922 3598.8557 3893.0001 3953.5220 4006.3983
redmass: 5.4235 5.0072 3.5398 4.0849 3.3645 1.0903 3.2467 1.5629 2.3282 1.3774 2.2702 1.1198 1.1741 2.9122 5.1555 1.0855 1.1590 1.0633 1.2862 1.1139 1.6115 1.6542 1.6209 1.2012 1.2129 1.1612 1.1092 1.0471 1.0636 1.0854 1.0768 5.8563 1.0382 1.0646 1.0994 1.1027 1.1063 1.1566 1.0602 1.0445 1.0691 1.0837
irintensity: 61.4245 2.5750 2.1967 1.6548 12.3264 27.9889 38.9810 5.8652 25.2920 262.2752 18.2232 40.8615 89.4760 5.0982 19.8887 90.2418 24.8366 160.5251 32.1860 69.0826 6.9770 4.7855 10.2562 5.8194 45.8216 17.7874 26.1482 18.3340 6.4699 146.2538 28.1649 48.1059 4.7986 20.4029 10.2398 20.3387 1.0532 134.6208 992.7432 34.8067 119.7497 131.7228
temp: 298.150 k
press: 1.00000 atm
elementType: 6 7 6 1 1 1 8 1 1 8 1 1 6 1 1 1
symmnumber: 1
zpe: 348309.4 jmol-1
zpe.correction: 0.132664 hartree
zpe.thermalcorrener: 0.143964 hartree
zpe.thermalcorrenthalpy: 0.144908 hartree
zpe.thermalcorrgfe: 0.095518 hartree
zpe.sumelectzpe: -324.967543 hartree
zpe.sumelectthermal: -324.956243 hartree
zpe.sumelectthermalent: -324.955298 hartree
zpe.sumelectthermalfe: -325.004689 hartree
dipole: -2.0811 -1.3580 -0.8849
dipole: 2.6378
quadrupole: 13.0796 -31.7859 -29.8046
quadrupole: 1.0183 -0.0344 0.2113
quadrupole: 29.2499 -15.6156 -13.6343 1.0183 -0.0344 0.2113
hfenergy: -325.1002068 hartree
pointgroup: C01 [X(C3H10N1O2)]
dipole: -0.7817737 -0.6015706 -0.2596552 debye
dipolederiv: -0.2937064 -0.2012585 -0.0126409 -0.3014321 -0.0639991 0.093745 -0.0804174 0.0535955 0.1432704 0.6780813 0.2022363 0.2606077 0.6351088 0.1863315 0.0707017 0.1067841 -0.0473126 0.0058216 0.8608805 0.1056118 -0.0262508 -0.2666823 -0.0363227 -0.0446414 0.1168477 0.1105137 0.0627042 -0.1873333 -0.0180462 -0.0379462 0.0407928 0.109062 -0.021066 0.0422094 -0.0149526 0.1303091 0.0770894 -0.0100439 0.0187854 -0.0457137 0.1447213 -0.0017869 0.0671478 -0.0027977 0.1632502 0.2940244 -0.0087155 0.0042993 -0.0864709 0.3377261 -0.0842871 0.0549008 -0.0511483 0.2798066 -1.1683562 0.0490394 0.0339675 0.0930413 -0.601922 0.0332143 -0.0221833 0.0053763 -0.719334 0.7476751 -0.0873064 -0.2369213 -0.1283941 0.3186403 0.0459386 -0.4258718 0.0419177 0.4419852 0.2475912 -0.0366664 -0.0491187 0.040152 0.3271571 -0.0232351 0.0166491 -0.0325615 0.3253056 -0.7027821 0.0039334 0.0220173 0.0364374 -0.5859055 -0.0809954 0.1096601 -0.0798422 -0.7051971 0.2789514 -0.0067395 0.0553556 0.0003036 0.3280072 0.0235926 0.0401316 0.025835 0.351003 0.2651113 0.0364197 0.0343095 0.0144706 0.3437897 0.0221795 0.0312159 0.0175314 0.3528253 -0.3554945 -0.0289364 -0.0152301 -0.0113673 0.014329 -0.0622748 -0.2072653 -0.0599118 -0.0019809 0.0828642 0.0582022 -0.0240267 0.0233939 0.0145644 0.0694063 0.0321498 0.043507 0.0410829 0.1290399 -0.0499467 0.0018289 -0.0347743 0.0228867 -0.0369876 0.038204 -0.0162317 0.0732545 0.0463638 -0.0077833 -0.0290364 -0.0088657 0.140934 -0.0035038 0.0798375 0.0064816 0.0558934 unknown
polarizability: 78.2087649|2.7244263|46.6608452|5.3449978|-1.1193771|47.2975339 unknown
InChI: InChI=1/3C.N.2O.10H
charge 1 multiplicity 1
16 atoms
C  -0.75673558 -0.3128787 0.08439149
N  -0.49576177 0.76201358 -0.34447122
C  -2.23400511 -0.0729261 -0.76180542
H  -2.16129618 -1.01277974 -1.31908912
H  -2.22295965 0.7396608 -1.49212354
H  -0.54062853 -1.19919084 0.66684607
O  1.60860739 0.1937207 0.96665392
H  2.40559128 0.04580463 0.41690929
H  1.9050412 0.70124622 1.72795251
O  3.77473681 -0.27434839 -0.65512692
H  4.21369959 0.40102149 -1.18031093
H  4.42884131 -0.95848201 -0.48541422
C  -3.31071677 0.06703489 0.28338505
H  -3.29864257 -0.73974289 1.01814816
H  -3.24768575 1.03093346 0.79176798
H  -4.26750755 0.03140894 -0.24956454
