program: Gaussian 09
title: 000052688
version: EM64L-G09RevD.01
frameworkgroup: C1[X(C5H12NO4P)]
method: RPBEPBE
basis: SDD
operation: Freq
keyword: #p
keyword: freq=noraman
keyword: PBEPBE/SDD
title: #p freq=noraman PBEPBE/SDD
converged: NO YES NO NO
title: Mulliken charges:
elementType: P O O O O N C C C C C H H H H H H H H H H H H
charge: 1.148872 -0.706677 -0.635970 -0.419925 -0.217191 -0.590488 0.217693 -0.782102 -0.693952 0.135829 -0.887375 0.285473 0.278271 0.222433 0.237051 0.232802 0.260402 0.277152 0.259769 0.320684 0.273401 0.394432 0.389415
chargesum: 0.00000
title: Mulliken charges with hydrogens summed into heavy atoms:
elementType: P O O O O N C C C C C
charge: 1.148872 -0.312245 -0.635970 -0.030511 -0.217191 0.003598 0.217693 -0.218358 -0.001665 0.135829 -0.090052
polarizability: 1.03182543e+02 -5.53108865e-01 9.51260914e+01 2.86937969e+00 7.68762561e-01 9.12988499e+01
1716.lowfreq: -26.4576 -11.7831 -7.5900 -0.0027 -0.0019 -0.0004 7.5714 60.0961 84.6249
frequency: -26.2977 60.0463 84.5729 137.8574 152.2755 156.5550 171.2114 221.6262 238.6903 247.6251 250.9338 262.8003 281.8143 306.1894 346.9890 358.1304 394.8251 440.7914 486.0957 530.5941 567.2566 609.8591 661.3282 696.6593 718.9043 722.3449 748.5172 845.6699 907.6464 919.4185 938.8310 967.3226 981.2837 1021.9960 1030.9295 1060.2278 1117.9635 1170.6343 1245.7434 1282.8669 1293.4832 1320.6289 1332.8351 1377.2981 1394.6062 1430.6785 1442.1959 1462.3669 1476.2954 1653.2645 1661.6485 2990.9272 3013.0333 3024.4441 3089.0210 3103.6943 3113.9153 3132.5911 3139.4420 3403.0196 3521.2798 3551.3152 3585.9593
redmass: 4.6924 7.8184 6.1601 1.4939 2.1361 4.9726 2.1771 3.4341 1.7156 2.7530 1.6434 2.3655 2.3315 2.0196 2.3232 2.9600 2.0542 2.3057 3.3640 2.0603 1.9976 6.9128 4.0799 5.4996 3.6198 5.2065 1.5805 1.8720 1.7678 1.8444 1.3544 1.8566 1.6231 2.9403 1.8094 1.9806 1.7706 1.7383 1.4334 2.1384 1.8413 1.7639 1.1709 1.1807 1.1020 1.0466 1.0465 1.0592 1.0519 4.2903 1.2661 1.0352 1.0319 1.0571 1.0988 1.1046 1.1015 1.1014 1.1023 1.0500 1.0643 1.0934 1.0659
irintensity: 7.5503 0.6696 4.0501 5.4804 0.5207 3.8121 26.9090 15.4739 2.9498 27.4492 5.4124 5.9208 21.9369 20.6760 45.9591 5.0265 144.4867 0.5314 18.4843 68.2418 72.9182 47.8503 14.5962 92.6172 31.3977 75.0419 154.9808 33.6755 14.7714 4.9390 63.9601 8.8651 13.6476 156.1650 2.0207 154.5812 49.5682 27.9359 5.8451 3.7084 5.5319 27.4948 19.0437 10.1668 13.5953 10.8464 13.5006 8.4774 12.2355 113.3780 160.5464 19.9865 1.8897 6.2432 24.1476 0.0959 15.9153 3.7381 3.4825 47.0631 22.4443 19.0650 51.6144
temp: 298.150 k
press: 1.00000 atm
elementType: 15 8 8 8 8 7 6 6 6 6 6 1 1 1 1 1 1 1 1 1 1 1 1
symmnumber: 1
zpe: 465700.1 jmol-1
zpe.correction: 0.177376 hartree
zpe.thermalcorrener: 0.190818 hartree
zpe.thermalcorrenthalpy: 0.191762 hartree
zpe.thermalcorrgfe: 0.138633 hartree
zpe.sumelectzpe: -893.708449 hartree
zpe.sumelectthermal: -893.695007 hartree
zpe.sumelectthermalent: -893.694063 hartree
zpe.sumelectthermalfe: -893.747192 hartree
dipole: -1.4295 -2.0322 -1.9450
dipole: 3.1554
quadrupole: -66.2099 -80.8669 -70.6188
quadrupole: 3.6871 -2.1572 0.8450
quadrupole: 6.3553 -8.3017 1.9464 3.6871 -2.1572 0.8450
hfenergy: -893.8858249 hartree
pointgroup: C01 [X(C5H12N1O4P1)]
dipole: 0.5701009 0.7500598 -0.8083921 debye
dipolederiv: 1.6600406 -0.017828 -0.0680133 -0.0226733 1.2676099 0.0247978 -0.0184227 0.0480244 1.4538809 -0.84147 -0.0442617 -0.0764232 -0.013582 -0.4701349 -0.2043063 -0.035538 -0.1915352 -1.0168929 -0.7676061 0.0399381 0.0308053 0.003508 -0.709999 -0.0216571 0.0145748 0.0266434 -0.5882895 -0.4865164 -0.130132 -0.120507 -0.0842638 -0.5710736 -0.4826797 -0.0646134 -0.3650899 -0.8368241 -0.3781752 -0.1231926 0.1720679 -0.1786371 -0.5604806 0.2341672 0.1164537 0.0154716 -0.881857 -0.4167656 -0.0223602 -0.0607345 -0.0330465 -0.7681052 -0.1000164 -0.0993287 -0.0827786 -0.5092253 0.2919558 0.0357154 0.0711527 0.0828331 0.2615831 0.1350652 -0.0459924 0.3362861 0.3731448 -0.2265257 0.0468594 0.0687204 0.0468993 -0.2097796 0.0380045 0.0835537 -0.0281478 -0.1659297 -0.0880543 -0.0197964 -0.0533097 0.0340872 -0.0070031 0.0477477 0.0330404 -0.0213384 0.0186784 0.3150629 0.262264 -0.1478366 0.3140178 0.8524269 0.0386327 -0.1249904 0.1305123 1.3036215 -0.4507672 -0.0199723 0.0997019 -0.0383581 -0.2209443 0.0777552 0.0458752 0.0337067 -0.2018218 0.0691198 0.0134948 -0.0384516 0.0393216 0.0756796 -0.0442077 -0.0044572 -0.0398828 -0.02181 0.0075239 -0.026589 0.0054408 -0.0592967 -0.0517252 0.0531806 -0.0082192 0.0393051 0.0956534 -0.1135418 0.0477429 0.0718983 0.0291715 0.0948032 0.0118806 0.1165662 -0.0136273 0.0103891 0.0751909 -0.0730782 0.0179798 -0.0496699 -0.0904256 0.0738452 -0.0008344 0.0689508 0.0736381 0.0861577 -0.0076101 -0.0194805 -0.0221921 0.0453705 -0.1099497 -0.0599519 -0.073869 -0.0524243 0.0793934 -0.0377959 0.0267504 -0.0468058 -0.0678693 -0.0127393 0.026628 -0.0160521 0.0949994 -0.0370733 0.0696072 -0.0337592 0.0523045 0.0742304 0.0400806 -0.02296 0.0322852 0.0994611 0.0984221 -0.0156926 -0.0132239 -0.0238071 0.1089905 -0.0205747 -0.0045603 -0.0238997 -0.0686788 0.3177501 -0.0067371 -0.0476654 0.0473013 0.2894594 0.0675251 -0.0654002 -0.0032557 0.1367546 0.0630186 -0.0154867 0.0709644 -0.0847002 0.356999 0.0523006 0.0794567 -0.0444653 0.1274336 0.347663 0.0488339 0.0126609 0.0545677 0.1483409 0.0420999 -0.0055366 0.0558094 0.3062693 0.3951967 -0.0039228 0.031262 -0.0469793 0.1520471 0.059048 0.0446567 0.1169469 0.2498293 unknown
polarizability: 102.4293224|-1.3104298|95.3136106|-3.8817417|-0.3423758|91.8645515 unknown
InChI: InChI=1S/C5H12NO4P/c1-5(6,4(7)8)3-11(2,9)10/h7,9H,3,6H2,1-2H3
charge 0 multiplicity 1
23 atoms
P  1.707362 -0.335945 -0.244808
O  1.930664 0.351205 1.372951
O  1.457647 -1.920067 -0.201121
O  -1.592097 -1.41653 -0.907263
O  -1.732536 -1.114123 1.39477
N  -0.751299 1.591505 1.155494
C  -0.991429 0.793594 -0.050906
C  0.312768 0.751259 -0.896898
C  -2.108339 1.4711 -0.895308
C  -1.461019 -0.66297 0.263437
C  3.263478 0.193766 -1.128463
H  0.094112 0.363056 -1.906232
H  0.70451 1.781445 -0.96837
H  -3.032823 1.564436 -0.29629
H  -1.777421 2.487271 -1.168632
H  -2.338343 0.890502 -1.803937
H  3.444869 1.265425 -0.951581
H  4.105612 -0.394808 -0.731733
H  3.162458 -0.001352 -2.208572
H  0.119261 1.331343 1.641019
H  -1.55894 1.610638 1.787172
H  2.146941 -0.346983 2.0432
H  -1.758238 -2.370368 -0.678929
