program: Gaussian 09
title: opt freq
version: EM64L-G09RevD.01
method: RwB97XD
basis: 6-31+G(d,p)
operation: Freq
keyword: #P
keyword: Geom=AllCheck
keyword: Guess=TCheck
keyword: SCRF=Check
keyword: GenChk
keyword: RwB97XD/6-31+G(d,p)
keyword: Freq
converged: YES YES YES YES
title: Mulliken charges:
elementType: C N C H H H O H H O H H C H H O C H H H
charge: -0.020049 -0.023483 -0.530423 0.275282 0.273588 0.286481 -0.828714 0.451960 0.393080 -0.781314 0.397042 0.400683 0.208701 0.230907 0.234408 -0.346429 -0.152190 0.168042 0.197743 0.164684
chargesum: 1.00000
title: Mulliken charges with hydrogens summed into heavy atoms:
elementType: C N C O O C O C
charge: -0.020049 -0.023483 0.304928 0.016327 0.016411 0.674016 -0.346429 0.378279
polarizability: 7.82733636e+01 4.98187244e+00 5.63648932e+01 6.42403143e-01 5.36349457e-01 7.54300230e+01
1716.lowfreq: -191.4807 -0.0009 0.0005 0.0008 7.5535 10.7212 14.9222 17.5014 33.3052
frequency: -191.4676 15.3831 32.0266 70.5998 95.0073 111.2528 116.5623 150.1842 184.9780 192.0430 212.6259 219.4704 263.1226 279.9953 285.8452 299.4774 361.3929 389.6469 476.3799 484.1253 581.1639 798.8737 890.3792 984.1748 993.1675 1025.3589 1037.3081 1185.2012 1196.5369 1248.0828 1251.3600 1345.4688 1397.2744 1433.6703 1457.2537 1478.2095 1499.2779 1505.6473 1526.5197 1641.9242 1679.9706 2160.6781 3032.5604 3050.9024 3080.0998 3088.1851 3131.4799 3203.8331 3212.3890 3244.7918 3627.4706 3891.4632 3960.6960 4003.9623
redmass: 6.3440 4.4404 4.8189 2.1083 3.6568 2.6871 3.6129 1.0586 1.9610 1.7393 3.4557 1.2275 4.5564 1.0811 1.1635 1.2233 3.2300 3.7363 5.5562 1.0755 6.0696 1.0540 2.9693 1.3307 1.9264 2.4710 1.4693 2.3218 1.2709 1.1302 2.2881 1.1048 1.3444 1.0775 1.0430 1.0752 1.0942 1.0540 1.0864 1.0850 1.0768 11.8518 1.0550 1.0341 1.1054 1.0238 1.1081 1.1043 1.1024 1.1170 1.0599 1.0445 1.0696 1.0836
irintensity: 32.1924 0.2456 3.1140 3.8330 6.8175 5.2030 7.1199 34.7277 12.6648 11.4291 1.4449 7.8022 1.9153 41.7833 80.1831 281.0873 4.0923 3.2556 4.7382 89.9505 9.5036 143.2425 9.2649 2.2201 20.5396 29.0315 0.6982 109.2985 6.4789 9.3345 96.7954 8.2295 35.8720 44.7646 28.7076 12.0790 10.4847 14.5287 14.3705 154.6317 24.8418 21.2510 20.0263 28.8806 0.4479 27.5614 21.6873 39.5012 3.3784 16.0691 814.7409 33.7764 117.7318 127.1500
temp: 298.150 k
press: 1.00000 atm
elementType: 6 7 6 1 1 1 8 1 1 8 1 1 6 1 1 8 6 1 1 1
symmnumber: 1
zpe: 437148.1 jmol-1
zpe.correction: 0.166501 hartree
zpe.thermalcorrener: 0.180426 hartree
zpe.thermalcorrenthalpy: 0.181370 hartree
zpe.thermalcorrgfe: 0.124541 hartree
zpe.sumelectzpe: -439.435472 hartree
zpe.sumelectthermal: -439.421547 hartree
zpe.sumelectthermalent: -439.420602 hartree
zpe.sumelectthermalfe: -439.477432 hartree
dipole: 0.7410 -0.7508 -1.1524
dipole: 1.5623
quadrupole: -10.8882 -41.4998 -26.7349
quadrupole: -3.6030 8.1429 -0.7914
quadrupole: 15.4861 -15.1255 -0.3606 -3.6030 8.1429 -0.7914
hfenergy: -439.6019728 hartree
pointgroup: C01 [X(C4H12N1O3)]
dipole: 0.2694801 -0.1796192 -0.3861178 debye
dipolederiv: -0.1685089 -0.1277206 0.0367764 -0.1312498 0.1987603 0.0262476 -0.0103506 0.0126683 0.4398915 0.5889951 0.2292813 0.3394627 0.2265516 -0.0417226 0.1050888 0.0600928 0.012391 -0.1355344 0.0576925 0.0183388 0.0815094 0.0316428 0.0281958 0.0204039 0.2914132 0.0813189 -0.0654541 -0.008592 -0.0230782 -0.1250896 0.0450869 0.1390677 0.0668026 -0.0840018 0.0124336 0.1266895 0.0511524 -0.0419738 -0.0622081 -0.1107345 0.0618564 -0.1229568 -0.048899 -0.0498442 0.1408555 0.1425044 -0.0167266 -0.0421182 -0.0118346 0.1840388 -0.0102761 0.0357756 0.0121897 0.2331688 -0.8675929 0.1110159 -0.1304424 0.1069064 -0.679067 0.0174993 -0.2274883 -0.0191658 -0.7434014 0.5590968 -0.247448 0.1140329 -0.3668069 0.5276324 -0.1509733 0.0967853 -0.0979617 0.3289805 0.25494 -0.0464787 -0.0203539 0.0014711 0.2996193 0.0193171 -0.030522 -0.0033441 0.323056 -0.648575 0.0022998 -0.037103 0.0770035 -0.7497317 0.0624431 -0.0396765 0.0327728 -0.5502527 0.2810276 0.058041 0.0072488 0.0464654 0.3490263 0.0020073 0.0014085 0.0098559 0.3172637 0.2977241 0.0494896 -0.0357646 0.0425822 0.3497275 0.0073527 -0.0244577 0.0050721 0.3075816 0.9391342 0.1673459 -0.4071915 0.2060156 0.4026147 -0.1489464 -0.0002465 -0.010144 0.2535481 -0.0060305 -0.0046009 0.0943761 0.0525037 0.0478265 0.0237627 -0.0160322 0.0089411 0.033869 0.0277788 0.0036782 0.0902227 -0.0670187 0.0090423 0.0433782 0.004866 -0.0095314 0.0396739 -0.9622272 -0.1462189 0.4162785 -0.1648147 -0.4528169 0.1079636 0.3179607 0.0701367 -0.8338619 0.4295381 -0.0019157 -0.2731763 -0.0118975 0.3353354 -0.0536213 -0.409187 -0.0967182 0.7907402 0.0650933 -0.0371625 0.0024898 0.0209872 -0.0980886 -0.0865193 0.069951 0.0016809 -0.0119622 -0.0189674 -0.0441147 0.0279188 -0.0517333 0.0874848 0.0026369 -0.0312905 -0.0198046 0.0388904 -0.0141835 0.097948 -0.0768686 0.0588739 0.0011986 0.0683893 0.0438989 0.0470528 -0.0337418 unknown
polarizability: 78.2733636|4.9818724|56.3648932|0.6424031|0.5363495|75.430023 unknown
InChI: InChI=1/4C.N.3O.12H
charge 1 multiplicity 1
20 atoms
C  -0.27594815 0.18683506 -0.9324033
N  0.53940226 0.38094259 -1.78016732
C  -1.17308991 -0.19495934 -2.31244409
H  -1.4232838 -1.22842904 -2.07338502
H  -1.97329804 0.53704088 -2.20533765
H  -0.72531537 -0.12860835 -3.30575599
O  1.91907106 1.00475012 0.33179883
H  2.60804643 0.35701494 0.58011892
H  2.34838909 1.86462579 0.33019702
O  3.70307904 -0.97294586 1.03285529
H  4.37742081 -1.316893 0.43962625
H  4.04723733 -1.07701811 1.92489474
C  -0.83572841 0.11053097 0.4489159
H  -0.15706976 -0.54691388 1.01291264
H  -0.74723906 1.12432126 0.86785025
O  -2.13553899 -0.35975241 0.35225507
C  -2.77850209 -0.47146807 1.62379728
H  -2.86589238 0.51144321 2.09971727
H  -3.77022895 -0.87373 1.42736952
H  -2.22550004 -1.15636903 2.27606617
