program: Gaussian 09
title: opt freq
version: EM64L-G09RevD.01
method: RwB97XD
basis: 6-31+G(d,p)
operation: Freq
keyword: #P
keyword: Geom=AllCheck
keyword: Guess=TCheck
keyword: SCRF=Check
keyword: GenChk
keyword: RwB97XD/6-31+G(d,p)
keyword: Freq
converged: YES YES YES YES
title: Mulliken charges:
elementType: C N C H H H O H H C H H C H H F
charge: 0.168025 0.054021 -0.483152 0.267575 0.259543 0.292958 -0.752345 0.405523 0.403146 -0.263575 0.258215 0.282816 0.017206 0.168715 0.193371 -0.272043
chargesum: 1.00000
title: Mulliken charges with hydrogens summed into heavy atoms:
elementType: C N C O C C F
charge: 0.168025 0.054021 0.336924 0.056324 0.277456 0.379293 -0.272043
polarizability: 7.00753209e+01 3.79697299e+00 6.59691070e+01 -8.47772895e-01 2.26752453e+00 4.52159510e+01
1716.lowfreq: -258.7856 -8.5716 0.0006 0.0010 0.0013 7.9333 17.8099 46.1070 78.9218
frequency: -258.7800 45.7108 78.5531 109.1053 124.7844 168.2482 191.5059 242.6279 248.8410 335.1302 377.3353 398.9216 405.5823 518.8689 594.4208 792.5411 896.8093 975.7387 1006.0561 1047.4284 1115.7310 1130.3819 1244.8411 1304.2234 1315.8695 1343.5636 1427.8279 1441.2476 1458.7225 1472.5427 1534.5517 1654.2553 2099.3239 3084.5031 3084.6601 3090.8053 3149.8975 3169.6114 3190.3548 3238.5632 3869.2313 3978.5895
redmass: 5.3728 2.9706 2.6958 2.8908 3.7747 3.0740 1.1567 1.2367 4.4995 2.7373 1.1847 3.5735 1.3950 5.6610 5.6797 1.1615 2.3136 1.2569 1.6438 3.3310 1.6575 6.7354 1.2023 1.2304 1.1660 1.1198 1.0724 1.2869 1.0622 1.0652 1.0868 1.0826 11.7318 1.0258 1.0595 1.0576 1.1106 1.1049 1.1028 1.1165 1.0448 1.0831
irintensity: 110.9838 0.6906 4.5977 2.2911 2.8161 8.5578 32.1472 10.3335 5.5475 57.7230 37.6188 35.6985 182.9796 0.4986 10.3221 0.5595 11.4373 2.0966 1.6546 31.9978 7.7217 101.6839 1.0793 4.9573 1.4449 4.8266 54.3461 28.0896 4.8439 41.6567 1.2047 92.9583 39.2809 32.9228 21.2096 1.9422 17.1077 4.5525 36.9737 11.4994 110.6983 134.1407
temp: 298.150 k
press: 1.00000 atm
elementType: 6 7 6 1 1 1 8 1 1 6 1 1 6 1 1 9
symmnumber: 1
zpe: 340681.5 jmol-1
zpe.correction: 0.129759 hartree
zpe.thermalcorrener: 0.139851 hartree
zpe.thermalcorrenthalpy: 0.140795 hartree
zpe.thermalcorrgfe: 0.094116 hartree
zpe.sumelectzpe: -387.065845 hartree
zpe.sumelectthermal: -387.055753 hartree
zpe.sumelectthermalent: -387.054809 hartree
zpe.sumelectthermalfe: -387.101488 hartree
dipole: -3.1970 4.2542 0.0671
dipole: 5.3220
quadrupole: -21.7586 -31.5078 -34.7149
quadrupole: 7.7458 0.8736 -1.0508
quadrupole: 7.5685 -2.1807 -5.3878 7.7458 0.8736 -1.0508
hfenergy: -387.1956039 hartree
pointgroup: C01 [X(C4H9F1N1O1)]
dipole: -1.2469453 1.6716899 0.0386788 debye
dipolederiv: 0.0173768 -0.563252 -0.0833743 -0.3740832 0.1511958 0.0450377 -0.07566 0.1295505 0.1948325 0.7534641 0.5624023 0.0496213 0.8470579 0.3140235 0.0324025 0.1344854 0.0239234 -0.0818674 0.1374237 0.2394073 0.0397884 -0.0935139 -0.2444289 -0.0481711 -0.0497812 -0.0872833 0.0078495 0.0025095 -0.0734219 0.0374629 -0.1314742 0.1086145 -0.0109444 0.1240062 0.0126338 0.096779 -0.017544 -0.0604771 -0.0473767 -0.0812591 0.1027878 0.0264225 -0.1439448 -0.0002938 0.1071512 0.2106168 -0.0008626 -0.0002558 -0.0981275 0.1748236 0.0028603 -0.0184451 -0.0013748 0.1841404 -0.9333678 -0.1756436 -0.0034357 -0.0908576 -0.5855195 -0.0051062 0.0166647 -0.0018859 -0.5024449 0.2878105 -0.0448432 -0.0122404 0.0036353 0.3151966 0.0146419 -0.0758658 -0.0270398 0.3240185 0.3013471 -0.0416256 -0.0008158 -0.0287453 0.3103592 -0.0163045 0.0746785 0.0299067 0.3158273 -0.029163 0.0102791 0.0537772 -0.0159607 -0.0605886 0.0169312 0.0067664 0.0612652 0.017555 0.0845282 0.0387966 -0.0463928 0.0244141 0.0760874 0.0200837 -0.0334375 0.0388779 0.084724 0.1210086 0.0101948 0.0016558 0.0352503 0.0266204 -0.0067512 -0.0024475 -0.0033716 0.106924 0.528805 -0.2160333 -0.0545052 -0.2809506 1.0590555 0.0518325 -0.0318054 -0.0190712 0.4505557 -0.0943454 0.0014337 0.0120807 0.0029164 0.0112475 0.0031706 -0.0340073 0.0110746 0.0423368 0.0496502 -0.0085569 -0.0332259 0.0139166 -0.0057344 -0.0348528 0.0034784 -0.0227179 -0.0515207 -0.4201202 0.3222024 0.0872362 0.2677815 -0.7537404 -0.0912527 0.1053148 -0.1441939 -0.2968608 unknown
polarizability: 70.0753209|3.796973|65.969107|-0.8477729|2.2675245|45.215951 unknown
InChI: InChI=1/4C.F.N.O.9H
charge 1 multiplicity 1
16 atoms
C  -0.50286022 0.61155825 -0.1196038
N  -0.57509532 1.77431852 0.17091256
C  -2.16179288 0.7035162 0.02577004
H  -2.46756247 0.3861755 -0.97244716
H  -2.35614941 0.00904724 0.84317698
H  -2.62295639 1.66788774 0.2526589
O  1.78298278 2.14851584 0.06250849
H  2.04590531 2.77655307 -0.6193258
H  2.15551966 2.48639278 0.88433049
C  0.26956786 -0.58784552 -0.4975756
H  0.04359626 -0.80825715 -1.54720749
H  1.32000074 -0.2944868 -0.41282611
C  -0.0407282 -1.81723921 0.37155695
H  -1.08500076 -2.13026063 0.27525876
H  0.20208394 -1.63607399 1.42245309
F  0.75712286 -2.82924268 -0.09702423
