program: Gaussian 09
title: 000052725
version: EM64L-G09RevD.01
frameworkgroup: C1[X(C19H19F3N2O4)]
method: RPBEPBE
basis: SDD
operation: Freq
keyword: #p
keyword: freq=noraman
keyword: PBEPBE/SDD
title: #p freq=noraman PBEPBE/SDD
converged: YES YES NO NO
title: Mulliken charges:
elementType: F F F O O O O N N C C C C C C C C C C C C C C C C C C C H H H H H H H H H H H H H H H H H H H
charge: -0.164196 -0.166738 -0.169478 -0.286544 -0.239194 -0.198870 -0.200845 -0.340224 0.027787 -0.046307 -0.578803 0.534544 -0.741709 -0.389401 -0.509746 -0.390155 -0.270202 0.300346 -0.209201 -0.385359 0.243602 0.202904 0.234373 -0.318706 -0.310545 0.388382 -0.350258 -0.344042 0.210182 0.234487 0.214922 0.267109 0.215458 0.247557 0.222687 0.219209 0.213634 0.267629 0.239304 0.225356 0.251737 0.236603 0.268487 0.282936 0.279193 0.292281 0.289816
chargesum: 0.00000
title: Mulliken charges with hydrogens summed into heavy atoms:
elementType: F F F O O O O N N C C C C C C C C C C C C C C C C C C C
charge: -0.164196 -0.166738 -0.169478 -0.286544 -0.239194 -0.198870 -0.200845 -0.073115 0.027787 0.163875 -0.129394 0.534544 -0.056007 0.043442 -0.242117 -0.150851 0.206891 0.300346 0.027402 -0.116872 0.243602 0.202904 0.234373 -0.035771 -0.031352 0.388382 -0.057978 -0.054226
polarizability: 3.58038263e+02 -1.54288575e+01 2.43357286e+02 -7.21894705e+00 -3.17273695e+01 1.42838553e+02
1716.lowfreq: -3.6389 -2.0501 -0.0011 0.0001 0.0007 6.5069 8.3471 12.4308 13.8726
frequency: 8.2620 10.7735 13.8285 16.0644 29.3509 36.7405 45.2088 57.5403 71.9550 78.3291 87.1677 105.3409 114.0281 127.1716 150.7246 174.5029 185.6391 193.7166 225.7246 241.2521 264.7947 269.6491 292.2585 301.7964 302.8940 328.2991 337.6997 378.1722 395.7125 409.9584 409.9972 431.0949 458.1969 458.8769 484.7706 490.9338 496.4966 520.1553 529.4864 576.8190 608.6238 610.8170 624.0526 636.2767 653.0469 681.1533 686.0263 699.4202 711.0938 765.1022 773.6031 797.4588 802.7160 817.7632 842.4161 858.9061 864.5135 889.5309 890.8239 908.9540 917.5343 931.5769 941.6391 981.6697 989.2060 992.9054 1004.1652 1005.7969 1007.1122 1012.8001 1039.1845 1058.0774 1067.6308 1068.9663 1083.4946 1089.6477 1094.9721 1109.1026 1110.8853 1141.6711 1163.7414 1175.8553 1187.0814 1198.1186 1206.7609 1213.3056 1214.5476 1244.5694 1265.2860 1275.2798 1292.5390 1295.4195 1307.3463 1315.4930 1333.7473 1342.3941 1367.8679 1387.6690 1389.4728 1393.2756 1405.8078 1415.0042 1436.2639 1459.9663 1466.3877 1469.9769 1475.7038 1477.4482 1480.6755 1482.8630 1490.4410 1590.3989 1599.6721 1610.1892 1618.4396 1622.9478 2866.3792 2900.0014 2980.1386 2993.6288 3011.8818 3039.3886 3057.8016 3070.3900 3091.3785 3097.5528 3124.1842 3142.3952 3152.9959 3164.9775 3175.5300 3177.1914 3188.5402 3193.3500 3458.0726
redmass: 7.2510 8.1002 11.5344 6.7337 5.8172 5.8478 4.8474 7.1779 3.8274 6.9448 4.1555 2.8778 4.9647 6.8112 4.4414 5.0455 4.0366 3.3220 1.4229 2.9554 6.7109 6.4204 5.6156 6.3055 6.3708 7.6905 3.5934 3.9522 2.6674 3.9850 2.8841 5.2159 3.6010 4.0387 4.4653 5.6464 4.9566 8.8853 4.8985 4.1554 4.3932 2.1764 6.8702 5.6809 6.1623 8.3165 3.9071 3.7085 2.8189 4.9895 8.0914 1.3814 1.5329 5.2702 2.0575 3.3487 1.2479 1.6636 1.6263 2.7591 1.9652 1.4610 2.0070 5.5706 6.1378 1.4946 1.3503 3.3100 6.2817 1.3659 2.1755 3.8882 2.3885 3.1637 1.9013 3.2280 2.5427 1.3518 1.6625 2.8748 1.5385 1.2342 1.1175 1.8025 1.5158 2.5651 2.3858 3.8901 1.1889 1.2366 1.2640 3.2135 1.3776 1.3517 1.3511 1.3616 7.9261 1.3814 6.8997 1.3849 8.6614 4.3895 2.9613 1.2053 1.1363 1.0878 2.3941 1.0987 1.4585 1.4444 1.0867 8.9573 6.1718 6.4324 6.1867 10.5959 1.0824 1.0709 1.0370 1.0607 1.0603 1.0873 1.1014 1.0995 1.1071 1.0981 1.0888 1.0924 1.0923 1.0902 1.0890 1.0972 1.0958 1.0974 1.0749
irintensity: 0.5568 1.0703 0.1079 0.3506 0.0368 0.2902 0.3207 0.7004 0.4784 2.5217 0.2314 1.0987 1.1595 0.0621 2.3236 1.8408 6.6644 3.7309 2.6045 1.1774 0.5371 0.8902 11.3443 1.0786 1.4358 3.2486 3.6598 10.8625 0.5328 23.1820 0.0256 0.4116 7.9584 2.4389 8.7088 6.8152 4.0279 2.9211 6.3259 23.7908 39.7380 54.3472 1.2185 1.5457 0.0119 4.7163 57.3433 12.3626 22.1452 4.2191 31.1133 14.9747 40.5470 8.4469 4.7538 22.3116 1.0631 52.7316 23.8172 1.8429 34.9327 23.1651 21.0856 177.3373 11.9744 17.0359 0.5963 44.5232 162.6335 0.0021 57.2089 26.0700 17.1366 429.6672 7.0777 11.0702 12.6402 12.3003 0.7218 71.8673 74.3434 3.8256 1.1930 63.7614 6.4031 436.5498 135.2435 215.2931 1.5776 27.9005 0.1883 189.9382 14.5872 16.6278 9.1510 54.2410 84.7587 16.3804 1.8276 13.6457 7.8273 67.8735 29.4661 16.4547 5.2768 4.9768 3.1199 4.8213 13.0844 4.2719 4.5761 48.7777 10.6645 5.6851 4.1799 135.8656 59.4375 84.7742 26.5108 26.6930 12.9186 19.2796 13.6365 35.0883 27.4080 27.3545 12.6066 3.5754 10.1258 1.3390 1.1203 5.1027 0.4651 0.7010 0.8203
temp: 298.150 k
press: 1.00000 atm
elementType: 9 9 9 8 8 8 8 7 7 6 6 6 6 6 6 6 6 6 6 6 6 6 6 6 6 6 6 6 1 1 1 1 1 1 1 1 1 1 1 1 1 1 1 1 1 1 1
symmnumber: 1
zpe: 923753.1 jmol-1
zpe.correction: 0.351839 hartree
zpe.thermalcorrener: 0.378828 hartree
zpe.thermalcorrenthalpy: 0.379773 hartree
zpe.thermalcorrgfe: 0.286965 hartree
zpe.sumelectzpe: -1443.219394 hartree
zpe.sumelectthermal: -1443.192405 hartree
zpe.sumelectthermalent: -1443.191460 hartree
zpe.sumelectthermalfe: -1443.284268 hartree
dipole: 1.1430 -0.4654 -2.8885
dipole: 3.1411
quadrupole: -258.7275 -164.5426 -162.1924
quadrupole: 21.6520 -9.4305 1.2893
quadrupole: -63.5733 30.6116 32.9618 21.6520 -9.4305 1.2893
hfenergy: -1443.571233 hartree
pointgroup: C01 [X(C19H19F3N2O4)]
dipole: -0.4606057 0.1790485 -1.1326848 debye
polarizability: 357.9624259|-15.8179059|243.9605066|5.2216678|31.2198344|142.3111688 unknown
InChI: InChI=1S/C19H19F3N2O4/c1-13(11-14-3-2-4-16(12-14)19(20,21)22)23-9-10-28-18(25)15-5-7-17(8-6-15)24(26)27/h2-8,12-13,23H,9-11H2,1H3
charge 0 multiplicity 1
47 atoms
F  -8.789258 -1.294382 0.510763
F  -7.825203 -0.090168 2.175268
F  -8.16351 0.857496 0.150406
O  2.517655 1.085986 -0.128579
O  3.738319 2.843433 0.795838
O  9.429903 -1.316176 0.470445
O  8.154958 -2.972513 -0.443149
N  -1.053251 1.962318 -0.754621
N  8.307118 -1.786711 0.043065
C  -2.33406 1.25228 -0.992628
C  -2.813894 0.57933 0.33576
C  -4.003223 -0.34526 0.14443
C  -3.374917 2.256153 -1.523247
C  0.175152 1.146514 -0.752927
C  -5.302995 0.042345 0.544334
C  -3.840133 -1.617319 -0.469419
C  1.291491 1.934711 -0.060939
C  -6.407674 -0.8180 0.333981
C  -4.94175 -2.473384 -0.679072
C  -6.237214 -2.07863 -0.278876
C  -7.765918 -0.358814 0.77832
C  3.689256 1.673046 0.345706
C  4.860867 0.747031 0.250618
C  6.117982 1.223024 0.705917
C  4.741547 -0.56634 -0.273791
C  7.110129 -0.905186 0.115443
C  7.254737 0.397519 0.641639
C  5.871157 -1.402795 -0.344434
H  -2.208695 0.443036 -1.754754
H  -3.048134 1.387198 1.05255
H  -1.965613 0.008689 0.76042
H  -0.964396 2.799133 -1.34454
H  -3.063329 2.672137 -2.499921
H  -4.356478 1.773114 -1.661099
H  -3.496284 3.093369 -0.810549
H  -0.01155 0.218455 -0.18303
H  0.514204 0.837509 -1.770121
H  -5.454216 1.015736 1.024772
H  -2.837274 -1.941538 -0.77391
H  1.501342 2.897982 -0.56245
H  1.047739 2.13826 0.995662
H  -4.795075 -3.45112 -1.149587
H  -7.097022 -2.736276 -0.43471
H  6.179826 2.240093 1.105022
H  3.766127 -0.917058 -0.619481
H  8.235899 0.734983 0.984541
H  5.814659 -2.419112 -0.742165
