program: Gaussian 09
title: ts
version: EM64L-G09RevD.01
method: RwB97XD
basis: 6-31+G(d,p)
operation: Freq
keyword: #P
keyword: Geom=AllCheck
keyword: Guess=TCheck
keyword: SCRF=Check
keyword: GenChk
keyword: RwB97XD/6-31+G(d,p)
keyword: Freq
converged: YES YES YES YES
title: Mulliken charges:
elementType: C N C H H H O H H C C C C H C H C H H O C H H H
charge: -1.216554 0.006110 -0.475510 0.250089 0.250074 0.265739 -0.675548 0.410887 0.410889 1.586737 0.302690 -0.569111 0.068820 0.218142 -0.322347 0.176031 -0.146649 0.184495 0.203438 -0.311067 -0.160451 0.172301 0.198456 0.172341
chargesum: 1.00000
title: Mulliken charges with hydrogens summed into heavy atoms:
elementType: C N C O C C C C C C O C
charge: -1.216554 0.006110 0.290393 0.146227 1.586737 0.520832 -0.393080 0.253315 -0.118910 -0.146649 -0.311067 0.382646
polarizability: 1.32494702e+02 -2.99540488e+00 1.91960731e+02 -5.48561324e-02 -7.64713815e-02 6.83590576e+01
1716.lowfreq: -141.8642 -16.1523 -14.0107 -11.2220 0.0010 0.0014 0.0015 42.5533 68.3511
frequency: -141.8433 41.3239 68.2823 125.6153 135.8737 167.6366 182.6413 196.9564 200.1687 255.5063 265.0829 291.5655 302.3273 395.4451 422.8780 447.8261 480.1607 511.8086 513.7157 543.4416 585.9587 642.4358 666.3767 723.4306 760.6037 833.2522 848.7245 861.9972 988.5788 999.8714 1010.9172 1018.5802 1023.4051 1071.6782 1166.9423 1180.3621 1203.5974 1211.8688 1241.2342 1345.9164 1359.3522 1365.3348 1384.9639 1447.5548 1463.8248 1490.6905 1495.5269 1508.1046 1511.6639 1573.9415 1620.3873 1641.7477 1670.4596 1891.2074 3064.8794 3084.5606 3153.7305 3182.8596 3212.8757 3229.6288 3241.1650 3254.9309 3257.7622 3274.4803 3847.5718 3962.3213
redmass: 5.5108 3.0280 3.5617 4.5895 3.4714 2.8759 1.1106 4.6853 1.2642 3.1140 1.7281 4.6988 1.7235 5.8132 3.0418 3.2967 1.1667 2.9023 1.9485 2.3272 4.0886 6.8923 4.9867 3.6945 4.0949 1.2499 5.6520 1.7790 1.2881 1.3037 1.6677 1.3136 2.6020 6.7831 1.2948 1.2756 1.5228 1.3410 2.0840 1.2936 1.2048 4.6586 3.5969 1.0784 1.0406 1.2120 1.7565 1.5864 1.0411 2.8312 6.4985 1.0856 5.4207 10.2463 1.0330 1.0271 1.1087 1.1012 1.1032 1.1143 1.0891 1.0970 1.0919 1.0947 1.0445 1.0835
irintensity: 142.3987 0.2884 5.2017 1.6482 2.6400 0.8297 42.6261 10.7412 20.5367 1.7157 3.0267 1.5852 0.4776 19.7518 0.1675 72.7573 6.3135 7.7440 130.6646 89.1156 17.0407 2.6891 10.9118 0.1043 14.8035 0.1121 12.9453 72.6285 0.0359 2.7578 6.1253 1.1971 2.1983 69.3801 3.6348 0.9179 329.3749 0.6374 14.6823 0.9082 21.3849 95.3189 286.7398 140.6966 25.3445 12.2465 39.0408 23.0798 15.6991 169.5781 6.0192 137.1775 669.6118 356.0762 31.1164 29.8748 15.7301 17.5222 3.8736 6.0510 1.3500 0.9176 8.9831 5.2666 172.9875 141.3053
temp: 298.150 k
press: 1.00000 atm
elementType: 6 7 6 1 1 1 8 1 1 6 6 6 6 1 6 1 6 1 1 8 6 1 1 1
symmnumber: 1
zpe: 515145.0 jmol-1
zpe.correction: 0.196208 hartree
zpe.thermalcorrener: 0.209089 hartree
zpe.thermalcorrenthalpy: 0.210034 hartree
zpe.thermalcorrgfe: 0.157144 hartree
zpe.sumelectzpe: -554.683924 hartree
zpe.sumelectthermal: -554.671043 hartree
zpe.sumelectthermalent: -554.670099 hartree
zpe.sumelectthermalfe: -554.722989 hartree
dipole: 0.9491 5.7585 -0.0048
dipole: 5.8362
quadrupole: -43.1209 -17.1649 -68.5199
quadrupole: -3.4456 -0.0158 -0.0273
quadrupole: -0.1856 25.7703 -25.5847 -3.4456 -0.0158 -0.0273
hfenergy: -554.8801328 hartree
pointgroup: C01 [X(C9H12N1O2)]
dipole: 0.3314055 2.2107891 -0.0012891 debye
dipolederiv: -0.5297849 0.0991542 0.0004779 -0.0689283 2.4105326 -0.0013212 0.0006251 -0.0015573 0.2232118 1.6439959 -0.1864053 -0.0010351 0.4310333 -1.1788182 0.0003569 -0.0014732 0.0009606 -0.1464667 0.0094872 -0.02432 -0.0000153 -0.3412782 -0.2217559 0.000374 0.0001782 0.0001479 0.01745 -0.0763173 0.0154879 0.0132821 -0.0347718 0.1447267 -0.0445808 0.11714 -0.0898116 0.0818777 -0.076493 0.0156153 -0.0130815 -0.0348954 0.1448936 0.0445512 -0.1168295 0.0896825 0.0818531 0.1647531 -0.0195231 0.0000297 -0.1059822 0.1818725 0.0000654 0.000087 -0.0000122 0.1675502 -1.2701106 -0.239303 0.0007728 0.0357494 -0.4174881 0.0000287 0.0004853 0.000187 -0.4295658 0.314945 0.0338183 -0.0243017 0.0211009 0.2956279 0.0152367 -0.1297931 -0.0372452 0.3245564 0.3150608 0.0338409 0.0242097 0.0210982 0.2956442 -0.0152797 0.1297854 0.0371834 0.3242098 -0.0672279 0.2950998 -0.0001408 0.0911858 -1.595519 0.0008972 -0.000031 0.0007188 -0.0486093 0.0591325 -0.5588215 0.0002351 -0.0915825 0.734983 -0.000403 -0.0000415 0.0000226 -0.0304566 0.0591615 0.4210911 -0.0004168 -0.021133 0.797864 -0.0005311 -0.0001115 -0.0009407 -0.0679132 -0.0458956 -0.6004865 0.0002308 -0.0634527 -0.8955389 0.0005515 -0.0001396 0.0011525 -0.1764136 0.080968 0.0158799 0.0000481 0.0016828 0.1458161 0.000005 0.0000697 0.0000169 0.1276421 -0.0864198 0.6562955 -0.0005003 0.1921954 -0.773564 0.0001956 -0.0002197 -0.0003077 -0.1548223 0.0241994 0.0534611 0.0000861 0.0733201 0.0617787 -0.0000365 0.0000679 -0.0000246 0.130885 0.3005946 0.1192905 -0.0001616 -0.2350944 2.4838895 -0.0012766 0.0000882 -0.0017312 0.2145463 0.0315383 0.0479994 0.0000973 0.0319625 0.0563641 0.0000097 0.0001159 0.0000138 0.150756 0.0582887 -0.0223723 0.0001269 -0.0216409 0.0655014 0.0000845 0.0001322 0.0000952 0.1585726 -0.5072347 0.3362154 0.000027 0.4234996 -2.5092896 0.0010082 -0.0000611 0.0012476 -0.2736767 0.5620767 -0.7030553 0.000184 -0.2528411 0.7520779 0.0000417 -0.0001268 0.0003869 0.3024827 -0.0143308 0.1272945 -0.0389337 -0.0320716 0.0369557 -0.0780063 -0.0698903 -0.0169563 -0.0439128 0.0636632 -0.0437374 0.0001313 0.0125388 -0.0537714 0.0001306 0.0000683 0.0002565 0.1106566 -0.01405 0.1274807 0.0386476 -0.0316944 0.0372173 0.0778983 0.0698742 0.0165146 -0.0444133 unknown
polarizability: 132.4947017|-2.9954049|191.9607311|-0.0548561|-0.0764714|68.3590576 unknown
InChI: InChI=1/9C.N.2O.12H
charge 1 multiplicity 1
24 atoms
C  -0.38827476 2.18476053 -0.00138761
N  0.23056406 3.24991744 -0.00258264
C  -1.7447247 3.04071988 -0.00099903
H  -2.24351512 2.74184661 -0.92380811
H  -2.24213918 2.74330939 0.92302249
H  -1.6220276 4.12692679 -0.00195516
O  2.37503898 2.81542309 -0.00376573
H  2.68898784 3.30368854 -0.7746977
H  2.6900608 3.30324302 0.76701242
C  -0.34302998 0.7547713 -0.00047566
C  0.89987049 0.09296 -0.0014467
C  -1.53787986 0.0010984 0.00130592
C  0.95240499 -1.28726998 -0.00062798
H  1.81665887 0.67001284 -0.00285465
C  -1.48705508 -1.37085645 0.00217509
H  -2.50666653 0.48927639 0.00205809
C  -0.24126176 -2.03296073 0.00123997
H  1.91713319 -1.77804082 -0.00147863
H  -2.39106214 -1.9683709 0.00355983
O  -0.29982094 -3.35801724 0.0022499
C  0.90450577 -4.12565892 0.00144943
H  1.492946 -3.91967188 0.90038245
H  0.58452757 -5.1652733 0.0029763
H  1.49050647 -3.92154138 -0.89950106
