program: Gaussian 09
title: ts
version: EM64L-G09RevD.01
method: RwB97XD
basis: 6-31+G(d,p)
operation: Freq
keyword: #P
keyword: Geom=AllCheck
keyword: Guess=TCheck
keyword: SCRF=Check
keyword: GenChk
keyword: RwB97XD/6-31+G(d,p)
keyword: Freq
converged: YES YES YES YES
title: Mulliken charges:
elementType: C C C C C C H H H H H C H C C C C H C H C H H H C
charge: -0.130077 -0.070715 -0.194363 0.114608 -0.186289 -0.049426 0.199790 0.198964 0.196879 0.194519 0.198654 -0.103706 0.244034 0.110101 -0.187747 -0.192694 -0.075321 0.196965 -0.049617 0.194369 -0.129635 0.198801 0.198758 0.199770 -0.076626
chargesum: 1.00000
title: Mulliken charges with hydrogens summed into heavy atoms:
elementType: C C C C C C C C C C C C C C
charge: 0.069714 0.128249 0.002516 0.114608 0.008230 0.149228 0.140328 0.110101 0.009219 0.001675 0.123480 0.149141 0.070135 -0.076626
polarizability: 2.16844566e+02 -7.15340362e+01 1.89315479e+02 -5.04677154e+01 8.01299007e+00 1.04453881e+02
1716.lowfreq: -551.9871 -10.9920 -7.4127 -0.0006 -0.0002 0.0001 11.5009 30.1892 44.4482
frequency: -551.9871 25.2801 44.0486 57.6536 146.1495 150.4131 257.4549 314.6833 324.6593 404.1406 413.4194 440.3319 475.9118 512.2399 547.4406 547.9757 631.9531 636.4445 691.2517 695.1294 718.0545 759.2249 782.1840 856.1835 866.6697 877.3386 899.5021 974.0492 981.4457 1015.8789 1022.6427 1024.2271 1025.6249 1046.8922 1052.0930 1057.3796 1060.9969 1123.9420 1127.3893 1159.9627 1204.3278 1207.0600 1218.6360 1224.2161 1318.4661 1345.1777 1351.0947 1373.2674 1375.7921 1494.0922 1499.1062 1533.3510 1545.4490 1648.9280 1651.7213 1669.7106 1674.1258 2223.9072 2342.6899 3228.9475 3233.2031 3234.0853 3238.7541 3241.1284 3242.0575 3248.8523 3254.0454 3255.8110 3259.2351
redmass: 2.6079 3.6978 4.6113 4.8893 4.5959 4.7922 6.2365 4.5479 1.2814 2.8494 2.8512 2.7151 6.0130 4.0983 7.3540 7.0262 6.5355 6.6774 2.3552 2.2312 6.2322 1.3215 1.4983 4.7753 1.2550 1.2495 1.6011 1.3421 1.3549 1.3780 6.0329 1.4334 5.2111 1.3474 1.3413 2.3761 2.1363 1.5427 1.5428 3.2011 1.1159 1.1225 1.1304 1.1600 3.3853 2.0346 2.1169 2.4838 2.2523 2.2667 2.2646 2.1029 2.2901 5.3859 5.4050 5.4435 5.3114 10.6910 1.0683 1.0904 1.0897 1.0885 1.0907 1.0930 1.0936 1.0968 1.0966 1.0995 1.0994
irintensity: 2010.4021 0.0088 0.3399 0.1041 4.0650 2.2229 0.1061 2.2315 48.2860 0.0145 0.8951 41.4429 0.9552 17.7960 4.8497 12.0310 0.8092 0.2954 9.2481 53.4465 0.0507 72.1042 106.3846 2.4095 4.1885 0.1824 505.0466 12.2165 26.1247 0.1153 9.1132 0.0581 2.2504 0.1432 0.1894 0.4084 4.0146 3.1749 7.6742 0.0238 1.5333 1.6705 16.6112 2.9215 130.9767 0.3806 3.3490 11.8377 10.8903 6.9774 27.4991 0.0932 1.1072 0.2030 1.0000 10.2996 92.3319 10.6044 16.9064 0.0396 0.0029 0.0038 0.0384 0.0100 0.0400 0.3360 0.3308 0.8309 0.7549
temp: 298.150 k
press: 1.00000 atm
elementType: 6 6 6 6 6 6 1 1 1 1 1 6 1 6 6 6 6 1 6 1 6 1 1 1 6
symmnumber: 1
zpe: 526868.3 jmol-1
zpe.correction: 0.200674 hartree
zpe.thermalcorrener: 0.211906 hartree
zpe.thermalcorrenthalpy: 0.212850 hartree
zpe.thermalcorrgfe: 0.161457 hartree
zpe.sumelectzpe: -539.404575 hartree
zpe.sumelectthermal: -539.393343 hartree
zpe.sumelectthermalent: -539.392398 hartree
zpe.sumelectthermalfe: -539.443792 hartree
dipole: 2.2490 1.2311 -1.5384
dipole: 2.9900
quadrupole: -35.2358 -46.5857 -74.1003
quadrupole: -24.5008 -17.5409 3.0916
quadrupole: 16.7381 5.3882 -22.1264 -24.5008 -17.5409 3.0916
hfenergy: -539.6052482 hartree
pointgroup: C01 [X(C14H11)]
dipole: -0.1862561 -0.0910757 -0.3642099 debye
dipolederiv: 0.1697311 -0.0198229 -0.0601473 -0.0186575 0.1713374 -0.0143135 -0.0658489 -0.0141003 -0.0245557 0.0109445 0.2379232 -0.0550706 0.2388345 -0.3660079 -0.0539151 -0.0334406 -0.058421 -0.0924732 0.2902451 -0.3919312 -0.0794101 0.2170406 -0.0446854 -0.0708343 -0.1695135 0.1538354 -0.0078565 -0.786 0.6248329 0.194314 0.4976864 -0.2555575 -0.1382124 0.0905103 -0.1120224 -0.0653191 0.094038 0.0950208 -0.0569023 -0.4957701 0.2297652 0.1351626 -0.0188996 -0.0538637 -0.0549013 -0.4485178 0.0400561 0.1043036 0.0226413 0.1445152 -0.0318565 0.1139473 -0.0480393 -0.1322938 0.036661 0.0421171 0.0266867 0.0405749 0.0650055 -0.0051111 0.0210316 -0.0012016 0.1316481 0.017895 -0.0173577 0.0415523 -0.0216472 0.0575886 0.0146806 0.0465125 0.0094592 0.1326681 0.1074511 0.014989 0.0061102 0.0098429 -0.0054195 0.0125884 0.0018009 0.0152626 0.140127 0.0113616 -0.0327202 0.0412389 -0.0303372 0.0994055 0.0146342 0.0383071 0.0204709 0.1271566 0.0764444 0.0022761 0.0222321 0.008399 -0.0041338 0.0113779 0.0241572 0.0136163 0.1387163 1.8656445 -1.263141 -0.3258453 -0.5982647 0.3359085 0.0120813 0.9315547 -0.6616105 -0.2245752 -0.6271738 0.5927787 0.2332332 0.6900536 -0.3434915 -0.2256417 0.2066826 -0.1759126 0.0754501 -0.6541466 0.5180765 0.1945161 0.5122314 -0.3345493 -0.243651 0.3317672 -0.3355224 -0.121047 0.2554082 -0.3555273 -0.0519691 0.1633028 -0.0447654 -0.1248398 -0.2549661 0.2216173 0.0290129 0.1097753 0.0218545 -0.1427272 -0.4391081 0.2176214 0.18961 0.0928228 -0.1553234 -0.056789 -0.1002392 0.2216839 -0.115603 0.2106174 -0.3620412 -0.0334552 -0.1343994 -0.0336364 0.0132555 0.1191959 0.0281667 0.0070659 0.029042 0.0078336 0.0386309 0.0118234 0.0348612 0.1144352 -0.3603942 0.0335096 0.1810078 0.008421 0.1119713 -0.1058246 0.1818335 -0.1125275 -0.1868584 0.0589969 -0.0173168 0.0723093 -0.0102108 0.1053935 0.022424 0.0732136 0.0215015 0.0732694 0.1148371 -0.0575133 -0.0989402 -0.0551142 0.148989 -0.0502194 -0.0933782 -0.0488226 0.053392 0.0543023 0.0089396 0.067065 0.0007406 0.0729005 0.0353177 0.0652219 0.0345429 0.0807025 0.090598 0.0247732 0.031293 0.0286703 0.014086 0.0418469 0.0264679 0.0455967 0.1060848 0.0593612 0.0460713 0.0383661 0.0506795 0.0655707 -0.0045805 0.0431123 -0.007054 0.107642 0.4335802 -0.3977389 -0.2746791 -1.0596687 0.9127595 0.5741006 -1.5303204 1.2472936 0.6431085 unknown
polarizability: 216.8445662|-71.5340362|189.3154786|-50.4677154|8.0129901|104.4538806 unknown
InChI: InChI=1/14C.11H
charge 1 multiplicity 1
25 atoms
C  4.36299331 -2.44855908 -1.19861434
C  4.43119173 -1.06337439 -1.35423884
C  3.3149056 -0.28075268 -1.09663202
C  2.12940003 -0.90536264 -0.67511031
C  2.05653729 -2.2993131 -0.51710547
C  3.1822414 -3.06506451 -0.78160206
H  5.23984606 -3.05350985 -1.40384974
H  5.35438036 -0.59508057 -1.67592467
H  3.35482176 0.79702716 -1.21244595
H  1.13449802 -2.76615932 -0.18717339
H  3.14128124 -4.14159873 -0.66112286
C  0.98121383 -0.10096486 -0.38855693
H  0.01092537 0.02425523 -1.23162724
C  -1.04662774 1.48963471 0.31662805
C  -1.9673664 0.99713787 1.25658768
C  -1.16322649 2.78805065 -0.20670542
C  -3.00420746 1.81900903 1.67411396
H  -1.86048378 -0.00678987 1.65324031
C  -2.20813385 3.59368006 0.22056214
H  -0.44174441 3.15390219 -0.92967372
C  -3.12398338 3.10935592 1.15610886
H  -3.71998621 1.45542637 2.40254586
H  -2.3108895 4.59798164 -0.17435048
H  -3.93845965 3.74547066 1.48616439
C  0.03535568 0.65256715 -0.10258505
