program: Gaussian 09
title: 000052683
version: EM64L-G09RevD.01
frameworkgroup: C1[X(C11H14N2O)]
method: RPBEPBE
basis: SDD
operation: Freq
keyword: #p
keyword: freq=noraman
keyword: PBEPBE/SDD
title: #p freq=noraman PBEPBE/SDD
converged: YES YES NO NO
title: Mulliken charges:
elementType: O N N C C C C C C C C C C C H H H H H H H H H H H H H H
charge: -0.229759 -0.371722 -0.700827 0.061272 -0.443170 -0.416234 0.110504 0.451194 -0.703427 -0.387697 -0.406367 -0.433568 -0.439070 0.505665 0.227161 0.241663 0.230489 0.205820 0.305563 0.244652 0.201419 0.220104 0.266839 0.222321 0.216028 0.214143 0.302499 0.304506
chargesum: 0.00000
title: Mulliken charges with hydrogens summed into heavy atoms:
elementType: O N N C C C C C C C C C C C
charge: -0.229759 -0.066159 -0.093823 0.061272 0.025655 0.020074 0.110504 0.451194 -0.037252 -0.120857 -0.184046 -0.217541 -0.224927 0.505665
polarizability: 1.76533490e+02 1.95401670e+00 1.16936058e+02 3.45835285e+00 1.99099719e+01 1.06643572e+02
1716.lowfreq: -6.3664 -0.0004 -0.0003 0.0005 4.8945 10.8613 46.2762 66.1345 95.6165
frequency: 46.1864 66.1118 95.6132 119.1334 140.6019 149.5725 187.9734 224.4852 280.3465 299.2205 310.4165 336.9041 366.7916 377.2904 399.1416 409.0170 427.8098 520.6622 547.9962 588.2483 619.3046 636.6861 676.6919 731.2969 743.9327 781.9629 815.4778 818.1305 830.6689 864.3414 914.3857 937.3892 962.7942 969.7634 986.5410 1000.5577 1005.9367 1018.2688 1087.2898 1106.7250 1121.1038 1130.5449 1135.4211 1168.9865 1195.9071 1237.5539 1244.1797 1298.7577 1313.5858 1317.0657 1331.1952 1338.5344 1373.8672 1389.4140 1432.4319 1462.1940 1475.2924 1484.6392 1485.8591 1519.2439 1576.1342 1632.3389 1644.1144 1725.8013 2975.2171 2978.5041 3007.9531 3034.1856 3068.5056 3076.9550 3086.2031 3108.2469 3117.1254 3132.7342 3146.0866 3543.4442 3568.3570 3708.7770
redmass: 3.7283 4.2667 2.7748 5.1588 3.1187 3.4769 2.3872 1.5406 4.2977 2.4456 3.2029 1.2518 1.0528 3.2757 3.4740 2.7238 2.4000 1.7149 1.8456 3.5750 5.2129 6.7583 7.8573 3.1740 4.0980 1.4006 1.4803 3.5038 1.6151 1.9647 3.2129 1.3755 1.4443 2.1374 2.3391 2.1609 2.4455 1.4537 2.2450 1.8346 1.5534 1.5502 1.5566 3.2391 1.1071 1.6798 1.6311 1.6594 2.1891 1.5161 1.6538 2.0015 4.9427 1.2104 3.5362 1.0788 1.0418 1.0836 1.0662 2.9730 6.7555 2.0846 1.8476 10.0998 1.0526 1.0456 1.0571 1.0989 1.0991 1.1091 1.1000 1.0866 1.0883 1.0961 1.0962 1.0817 1.0448 1.1040
irintensity: 0.7008 1.5977 3.3516 3.0856 0.4054 2.7326 2.7119 1.7279 3.0817 3.4550 5.9919 301.7540 1.9858 6.8083 8.1865 0.1548 34.3883 47.5130 112.3539 13.6834 1.2910 0.8061 3.5786 0.8441 2.6209 18.0753 16.0873 9.4325 53.4953 0.5860 3.9282 0.6439 1.3828 6.3481 1.2629 5.4696 1.0256 0.3340 5.5901 9.1639 11.0910 38.2319 66.6016 17.6533 20.6758 3.2179 26.9700 0.6077 54.5021 13.4710 28.4001 4.2524 8.3015 17.6959 0.1130 4.0321 7.4491 7.2979 7.8824 140.5655 1.8958 0.3854 287.6070 348.5492 38.7259 24.2848 42.9086 11.8708 51.7516 26.4718 51.6342 16.7575 24.1094 25.6493 4.2671 10.2664 71.0946 19.6758
temp: 298.150 k
press: 1.00000 atm
elementType: 8 7 7 6 6 6 6 6 6 6 6 6 6 6 1 1 1 1 1 1 1 1 1 1 1 1 1 1
symmnumber: 1
zpe: 604043.1 jmol-1
zpe.correction: 0.230068 hartree
zpe.thermalcorrener: 0.243773 hartree
zpe.thermalcorrenthalpy: 0.244717 hartree
zpe.thermalcorrgfe: 0.189995 hartree
zpe.sumelectzpe: -611.260317 hartree
zpe.sumelectthermal: -611.246612 hartree
zpe.sumelectthermalent: -611.245668 hartree
zpe.sumelectthermalfe: -611.300390 hartree
dipole: -2.2413 2.8958 2.3170
dipole: 4.3333
quadrupole: -61.1141 -89.1877 -80.0925
quadrupole: 7.6132 7.0179 0.4692
quadrupole: 15.6840 -12.3896 -3.2944 7.6132 7.0179 0.4692
hfenergy: -611.4903851 hartree
pointgroup: C01 [X(C11H14N2O1)]
dipole: -0.8830791 -0.970861 -1.0881889 debye
polarizability: 176.5354373|-3.3583825|110.9763883|-1.9544071|20.5617266|112.6012944 unknown
InChI: InChI=1S/C11H14N2O/c1-2-11(7-13-10(11)14)8-3-5-9(12)6-4-8/h3-6,13H,2,7,12H2,1H3
charge 0 multiplicity 1
28 atoms
O  2.239994 1.985665 1.099553
N  2.82829 0.917938 -0.994783
N  -4.390886 0.339348 -0.086205
C  1.370344 -0.251123 0.030495
C  2.140443 -0.354973 -1.351899
C  1.810556 -1.312959 1.080248
C  2.170442 1.099191 0.221021
C  -0.141232 -0.07731 -0.041414
C  1.28891 -2.736532 0.794214
C  -0.806075 0.762875 0.891459
C  -0.936476 -0.776775 -0.984395
C  -2.206064 0.90421 0.880111
C  -2.339558 -0.64547 -1.007714
C  -3.000336 0.2005 -0.071776
H  2.821738 -1.219788 -1.439687
H  1.500085 -0.275156 -2.246227
H  1.451564 -0.975224 2.071436
H  2.918374 -1.321449 1.131838
H  3.526162 1.480033 -1.486249
H  0.185364 -2.76089 0.777639
H  1.651917 -3.114015 -0.180982
H  1.635274 -3.438707 1.574285
H  -0.212098 1.326269 1.620376
H  -0.458757 -1.442531 -1.714079
H  -2.692312 1.56851 1.605551
H  -2.928185 -1.197977 -1.750854
H  -4.957311 -0.154685 -0.768879
H  -4.858967 0.950925 0.575518
